program: Gaussian 09
title: 000265294
version: EM64L-G09RevD.01
frameworkgroup: C1[X(C11H12ClN3O4)]
method: RPBEPBE
basis: SDD
operation: Freq
keyword: #p
keyword: freq=noraman
keyword: PBEPBE/SDD
title: #p freq=noraman PBEPBE/SDD
converged: YES YES NO NO
title: Mulliken charges:
elementType: Cl O O O O N N N C C C C C C C C C C C H H H H H H H H H H H H
charge: -0.024131 -0.261206 -0.443024 -0.478181 -0.501561 -0.161571 -0.027747 0.052704 -0.083506 -0.174561 -0.176725 0.005412 -0.398706 0.121739 -0.183957 0.347269 -0.395152 -0.349504 -0.364850 0.298754 0.267215 0.246952 0.240176 0.244387 0.234699 0.330424 0.348741 0.386784 0.270234 0.376249 0.252644
chargesum: 0.00000
title: Mulliken charges with hydrogens summed into heavy atoms:
elementType: Cl O O O O N N N C C C C C C C C C C C
charge: -0.024131 -0.261206 -0.094283 -0.091397 -0.125312 -0.161571 -0.027747 0.052704 0.215248 0.092654 0.070228 0.245588 0.080380 0.121739 0.146467 0.347269 -0.124919 -0.349504 -0.112207
polarizability: 2.24374435e+02 -2.50130845e-02 1.57858268e+02 -6.28294888e+00 1.56498029e+01 1.03147282e+02
1716.lowfreq: -13.0816 -0.0024 -0.0015 -0.0014 3.3915 7.2123 17.7365 37.2893 54.4933
frequency: 15.1638 36.9998 54.4444 83.6527 106.4509 122.7555 139.7845 182.8644 201.6567 223.7886 229.6538 251.7238 268.2630 285.1242 304.6882 322.3421 350.9731 372.0526 380.4943 429.5406 457.3639 530.3354 543.5758 566.3034 602.2570 608.9326 633.2488 643.7720 700.3330 722.1406 728.6390 763.7999 770.1008 812.1964 814.1351 818.6573 875.7292 898.4762 905.0990 926.8635 935.6900 944.3553 962.5239 991.0807 1011.7491 1018.9920 1048.8112 1071.5047 1098.9886 1118.9391 1130.0126 1174.6804 1177.9163 1183.9743 1193.7822 1223.5055 1235.4796 1256.8120 1273.3726 1283.7535 1296.0161 1301.2247 1306.5011 1339.6600 1344.3324 1359.1611 1377.8755 1394.8411 1405.2367 1414.0587 1426.4265 1474.6277 1482.8390 1520.2142 1575.2526 3000.9961 3001.5325 3022.2995 3030.8307 3072.3118 3073.4204 3186.4880 3189.7481 3239.4857 3372.5830 3573.4389 3601.2281
redmass: 5.3748 5.8907 9.4506 4.1813 7.1279 4.5189 6.7183 8.6455 6.7103 6.1723 5.4816 5.9481 5.4465 1.6451 2.6010 1.2700 3.5547 15.0819 4.2500 4.6384 6.0072 5.9614 5.2735 4.1483 8.9096 4.6886 7.5215 6.8089 1.8930 1.9602 3.2341 2.2109 6.2527 2.2177 5.0891 5.3160 4.6519 6.9592 1.4285 2.6212 1.4056 3.3982 3.4413 3.4469 2.4599 4.2845 1.9836 2.5488 1.9479 5.1358 2.0878 1.3289 1.5237 1.5061 1.5045 1.2275 2.0856 1.2994 1.2790 1.5553 3.0352 2.0115 1.3664 1.4863 2.4892 1.5302 1.5825 2.5875 1.5950 1.5385 3.3567 1.0770 5.3880 5.5248 9.9456 1.0833 1.0581 1.0875 1.0874 1.0972 1.0985 1.0928 1.0985 1.1021 1.0651 1.0665 1.0670
irintensity: 2.5728 0.2380 1.4327 4.8651 0.0482 2.9253 6.8724 1.6195 9.6085 6.3569 11.6501 2.3552 6.7674 89.8159 61.4823 132.8685 26.8291 12.8099 13.6782 1.2241 15.5071 17.3690 0.6079 6.1430 2.2226 3.1245 2.8292 1.5798 44.9709 69.1448 43.7408 61.2752 118.4866 36.1500 71.1714 3.8476 38.8271 58.1615 14.7447 35.6016 9.2018 9.0912 122.0740 82.6179 38.5061 181.3754 12.4196 5.0120 25.5580 4.7701 42.9615 11.9754 50.5560 60.3400 28.0380 11.5835 147.6697 13.1643 24.2876 4.8616 19.8072 45.0751 7.6084 1.8578 137.5616 23.4132 5.6612 69.5293 4.6401 52.3161 102.3197 9.0762 109.7399 33.0751 55.7861 8.4001 39.8640 63.3324 17.2120 25.0338 30.2968 10.3324 71.1209 0.8139 167.9168 11.6918 13.4140
temp: 298.150 k
press: 1.00000 atm
elementType: 17 8 8 8 8 7 7 7 6 6 6 6 6 6 6 6 6 6 6 1 1 1 1 1 1 1 1 1 1 1 1
symmnumber: 1
zpe: 600542.9 jmol-1
zpe.correction: 0.228735 hartree
zpe.thermalcorrener: 0.245682 hartree
zpe.thermalcorrenthalpy: 0.246626 hartree
zpe.thermalcorrgfe: 0.182413 hartree
zpe.sumelectzpe: -1350.134402 hartree
zpe.sumelectthermal: -1350.117455 hartree
zpe.sumelectthermalent: -1350.116511 hartree
zpe.sumelectthermalfe: -1350.180724 hartree
dipole: 8.4303 -2.5124 -0.5857
dipole: 8.8162
quadrupole: -116.0850 -111.4962 -112.9017
quadrupole: -7.7931 4.8077 -9.1237
quadrupole: -2.5907 1.9981 0.5925 -7.7931 4.8077 -9.1237
hfenergy: -1350.363137 hartree
pointgroup: C01 [X(C11H12Cl1N3O4)]
dipole: 3.390158 -0.5824333 -0.4455418 debye
polarizability: 222.7477458|9.0908221|154.441636|-11.9792383|20.5547117|108.1906038 unknown
InChI: InChI=1S/C11H12ClN3O4/c12-9-5-1-2-15(10(5)14-4-13-9)11-8(18)7(17)6(3-16)19-11/h1-2,4,6-8,11,16-18H,3H2
charge 0 multiplicity 1
31 atoms
Cl -4.812883 -2.103135 -0.2824
O  1.72362 0.463632 1.199347
O  2.16387 2.704674 -0.994911
O  2.887842 -0.888332 -1.492762
O  4.720679 -1.504967 0.370514
N  -0.222372 0.102766 -0.185509
N  -2.017947 1.410312 0.87195
N  -4.200162 0.317906 0.804667
C  0.88384 1.013183 0.112639
C  1.833089 1.27788 -1.083902
C  3.082217 0.400725 -0.823605
C  3.119058 0.283607 0.724777
C  3.586502 -1.089417 1.23627
C  -1.538514 0.318451 0.223664
C  -0.156588 -1.154036 -0.824302
C  -2.316002 -0.831268 -0.182373
C  -1.417834 -1.745114 -0.841481
C  -3.682669 -0.735715 0.162349
C  -3.350684 1.350845 1.13525
H  0.431975 1.955911 0.463934
H  1.371055 1.018247 -2.05443
H  4.00075 0.889991 -1.201898
H  3.73591 1.101823 1.141207
H  2.748363 -1.805453 1.146046
H  3.906523 -1.024325 2.291678
H  0.800196 -1.500402 -1.217567
H  2.696034 2.970094 -1.786503
H  3.658341 -1.457248 -1.198236
H  -1.670283 -2.709263 -1.276249
H  5.203675 -2.264501 0.777905
H  -3.798198 2.199227 1.657733
