program: Gaussian 09
title: 000265304
version: EM64L-G09RevD.01
frameworkgroup: C1[X(C20H23N5)]
method: RPBEPBE
basis: SDD
operation: Freq
keyword: #pfreq=noraman
keyword: PBEPBE/SDD
title: #p freq=noraman PBEPBE/SDD
converged: YES YES NO NO
title: Mulliken charges:
elementType: N N N N N C C C C C C C C C C C C C C C C C C C C H H H H H H H H H H H H H H H H H H H H H H H
charge: -0.431214 -0.106015 -0.112107 -0.639469 -0.596456 -0.573878 -0.476595 0.250006 -0.333325 0.105953 -0.676584 0.089454 0.502535 0.464660 -0.067585 -0.448162 -0.393750 -0.370813 -0.430368 -0.229836 -0.220852 -0.250920 -0.221094 -0.195379 -0.276666 0.191333 0.253728 0.225671 0.222566 0.203861 0.214233 0.252602 0.207066 0.295457 0.231140 0.260743 0.321548 0.326769 0.237040 0.211988 0.224621 0.223982 0.227168 0.323440 0.325652 0.216363 0.218154 0.223338
chargesum: 0.00000
title: Mulliken charges with hydrogens summed into heavy atoms:
elementType: N N N N N C C C C C C C C C C C C C C C C C C C C
charge: -0.135758 -0.106015 -0.112107 0.008848 0.052636 -0.128817 -0.028359 0.250006 0.084768 0.105953 -0.216916 0.089454 0.502535 0.464660 -0.067585 -0.217022 -0.133007 -0.133773 -0.218380 -0.005215 0.003130 -0.023752 -0.004731 0.022774 -0.053328
polarizability: 3.27699789e+02 3.06991370e+01 2.56320445e+02 3.09408156e+00 2.13363905e+01 1.76934734e+02
1716.lowfreq: -12.5861 -4.4000 -0.0005 0.0002 0.0004 2.4714 9.5930 14.5537 23.7709
frequency: -5.5466 13.6048 23.3218 30.6024 40.6665 50.3225 54.7671 72.0718 98.6006 113.2909 124.7084 178.3420 209.5784 214.7529 224.2063 229.7651 255.5795 276.7606 288.9101 324.6728 333.7979 342.4636 365.2866 404.7192 409.0642 415.8418 430.2057 453.3613 459.2178 505.7065 511.0447 515.0061 528.0820 534.0210 551.1174 564.7113 596.0600 610.2223 614.3368 625.1307 687.8079 690.4711 707.3126 719.1359 745.5106 753.9171 755.2523 766.5033 789.4187 812.7360 824.1520 827.2749 848.6282 856.5145 868.9446 890.2497 926.8216 928.8139 953.2200 972.2539 976.0555 978.6494 988.9960 991.3936 997.8539 1019.8176 1025.9503 1030.0692 1042.8488 1057.3463 1080.0807 1082.4680 1110.5079 1124.1252 1127.4839 1164.3018 1168.5647 1170.8049 1186.8677 1187.2429 1190.5651 1202.1730 1213.2953 1246.9359 1264.3020 1281.9545 1289.4755 1291.2660 1311.3462 1326.7376 1331.6411 1334.3113 1361.5465 1377.2263 1382.1929 1386.5677 1430.5649 1436.4971 1442.9864 1456.8922 1473.4609 1476.9548 1480.6536 1482.4930 1494.9206 1503.3627 1510.0911 1537.2806 1563.3508 1588.7052 1592.5185 1600.5526 1612.5550 1621.1148 1626.8382 2912.4465 2946.4502 2953.0270 2973.4136 3000.9600 3023.5020 3049.1361 3057.6843 3106.5252 3107.8598 3122.1080 3122.2684 3134.1117 3135.0114 3144.5737 3151.0269 3161.2849 3165.6311 3557.2104 3565.0322 3568.1214 3713.5035 3725.6941
redmass: 3.6322 5.5662 4.2620 4.6589 4.3323 4.6079 4.6386 4.5985 1.9569 4.1396 3.5041 4.6239 4.9756 6.1441 3.5598 4.9383 4.5578 4.2373 1.1898 2.8233 2.4065 2.0263 1.2603 2.8294 2.9238 3.7405 1.2367 3.7015 3.1495 2.6775 1.8114 2.0596 1.1420 2.7910 4.3622 4.7203 5.0776 5.7388 6.3986 5.6711 5.5903 1.8360 2.0740 4.0604 1.1777 1.9122 1.8534 5.0787 6.6228 1.2665 4.7956 4.4404 1.3881 1.2480 1.5297 2.0125 1.6094 2.1915 1.3600 1.2934 5.8080 1.3804 3.6983 2.2306 1.5202 2.7103 2.2438 2.9649 1.8770 3.1340 1.7350 1.6041 2.1255 2.3282 2.5569 1.3587 1.0489 1.0655 1.1263 1.1098 1.3376 2.4214 2.8131 1.3354 1.2201 1.1686 1.5662 1.5239 3.9687 1.4195 1.3559 1.5481 1.6615 4.8977 7.4742 3.2529 2.4039 3.3589 2.5507 1.2322 1.6240 1.5180 1.8209 2.0362 1.2073 1.3020 1.9672 4.4038 4.4541 5.1394 5.8179 1.5744 5.5350 1.5131 5.3849 1.0570 1.1025 1.0685 1.0598 1.0596 1.0971 1.0973 1.1006 1.0871 1.0877 1.0858 1.0858 1.0913 1.0928 1.0959 1.0934 1.1014 1.1007 1.0452 1.0438 1.0771 1.1037 1.1059
irintensity: 0.6865 0.0040 0.1639 0.3521 0.1325 0.4722 0.1417 0.5995 3.6450 3.4402 5.3296 3.2118 8.6831 4.7095 0.5783 0.8456 1.7565 3.0512 77.9442 12.8482 10.5521 8.6794 136.5318 0.0828 0.0915 10.2082 303.5854 1.6283 4.5668 13.2726 20.9854 15.5524 15.5424 18.4400 12.2849 25.8738 1.2771 0.5885 0.4198 3.5396 6.3178 40.3507 44.7089 32.5817 24.8631 21.8557 74.3292 2.7961 10.2552 0.3989 9.5089 8.1724 0.6797 0.0663 8.8430 6.3441 1.3072 2.6105 0.0238 0.5435 5.6245 0.0021 0.7847 1.2185 0.8129 4.6742 9.9157 4.1822 4.4548 1.2418 5.5304 9.1707 15.3881 8.4596 11.8744 5.4154 1.4660 0.3960 1.6773 11.8706 1.4036 2.7249 2.4530 4.9012 9.0701 1.0846 12.5469 19.5394 26.4926 20.7786 14.8472 31.9311 2.8380 1.9548 1.4869 63.1112 24.4246 154.6787 38.7568 21.2324 57.7071 48.9176 7.1278 22.7251 39.7664 131.8046 117.1138 269.5989 187.5915 10.8148 3.4690 663.2669 24.9092 257.2127 203.4784 64.9443 30.1505 28.5508 34.7556 21.4915 17.1799 35.9977 12.2757 16.2102 13.9963 0.0351 4.6596 16.8509 30.4883 31.1487 47.0790 28.1436 14.6389 70.4292 116.7171 27.2083 34.2844 43.1399
temp: 298.150 k
press: 1.00000 atm
elementType: 7 7 7 7 7 6 6 6 6 6 6 6 6 6 6 6 6 6 6 6 6 6 6 6 6 1 1 1 1 1 1 1 1 1 1 1 1 1 1 1 1 1 1 1 1 1 1 1
symmnumber: 1
zpe: 1038060.7 jmol-1
zpe.correction: 0.395376 hartree
zpe.thermalcorrener: 0.418020 hartree
zpe.thermalcorrenthalpy: 0.418964 hartree
zpe.thermalcorrgfe: 0.340755 hartree
zpe.sumelectzpe: -1047.921222 hartree
zpe.sumelectthermal: -1047.898579 hartree
zpe.sumelectthermalent: -1047.897635 hartree
zpe.sumelectthermalfe: -1047.975844 hartree
dipole: -1.0527 -1.5091 1.0851
dipole: 2.1361
quadrupole: -153.8984 -137.3077 -144.3334
quadrupole: 4.2771 -2.7198 3.4093
quadrupole: -8.7186 7.8722 0.8464 4.2771 -2.7198 3.4093
hfenergy: -1048.3165988 hartree
pointgroup: C01 [X(C20H23N5)]
dipole: -0.3556311 -0.7561163 0.0899832 debye
polarizability: 317.2171003|30.1064972|231.3999739|24.7735702|49.535071|212.337894 unknown
InChI: InChI=1S/C20H23N5/c21-19-17(12-7-13-23-16-10-5-2-6-11-16)18(24-20(22)25-19)14-15-8-3-1-4-9-15/h1-6,8-11,23H,7,12-14,21-22H2
charge 0 multiplicity 1
48 atoms
N  3.534522 -0.234987 -0.317826
N  -3.2985 -1.155956 -1.961535
N  -2.607966 -3.344222 -1.115867
N  -0.798275 -3.590482 0.31864
N  -4.433909 -3.114775 -2.561999
C  -0.241607 -0.683035 0.335014
C  1.119794 -0.758454 -0.411756
C  -1.383537 -1.31646 -0.439045
C  2.269517 -0.145945 0.411464
C  -2.278829 -0.573958 -1.249454
C  -2.197586 0.942935 -1.379685
C  -1.60088 -2.737253 -0.416529
C  -2.792029 1.695399 -0.185111
C  4.756778 0.22685 0.174854
C  -3.411412 -2.520115 -1.854045
C  -2.091846 2.769314 0.420483
C  -4.072547 1.347444 0.318354
C  4.868458 0.814793 1.470621
C  5.93578 0.113148 -0.624013
C  -2.655403 3.482805 1.503825
C  -4.636494 2.056808 1.400922
C  -3.930401 3.127481 1.999318
C  6.120495 1.267843 1.939682
C  7.176013 0.570863 -0.141427
C  7.284217 1.1533 1.145957
H  -0.136656 -1.164272 1.331256
H  -0.476886 0.373918 0.55263
H  1.357887 -1.812895 -0.657056
H  1.028283 -0.22205 -1.37747
H  2.349605 -0.678028 1.385667
H  2.026548 0.913978 0.650526
H  -2.760567 1.204175 -2.294174
H  -1.151462 1.266377 -1.532974
H  3.50945 -0.607092 -1.266542
H  -1.104144 3.056193 0.036211
H  -4.619977 0.519562 -0.146588
H  -0.041318 -3.25119 0.902539
H  -1.02744 -4.581886 0.304977
H  3.984048 0.919803 2.107038
H  5.868518 -0.336415 -1.623606
H  -2.101108 4.312026 1.958414
H  -5.62707 1.777194 1.778051
H  -4.368957 3.67785 2.839352
H  -4.553214 -4.122144 -2.512959
H  -5.04385 -2.530143 -3.125844
H  6.183416 1.716668 2.938281
H  8.065873 0.472743 -0.774477
H  8.250965 1.508189 1.517506
