program: Gaussian 09
title: 000265270
version: EM64L-G09RevD.01
frameworkgroup: C1[X(C9H8BrClO2)]
method: RPBEPBE
basis: SDD
operation: Freq
keyword: #p
keyword: freq=noraman
keyword: PBEPBE/SDD
title: #p freq=noraman PBEPBE/SDD
converged: YES YES NO NO
title: Mulliken charges:
elementType: Br Cl O O C C C C C C C C C H H H H H H H H
charge: 0.027831 -0.056699 -0.392596 -0.222333 -0.523109 0.564045 -0.559149 -0.323803 -0.372426 -0.222557 -0.236215 0.271445 -0.224146 0.267936 0.266194 0.349763 0.267906 0.257655 0.236242 0.237950 0.386066
chargesum: 0.00000
title: Mulliken charges with hydrogens summed into heavy atoms:
elementType: Br Cl O O C C C C C C C C C
charge: 0.027831 -0.056699 -0.006530 -0.222333 0.011022 0.564045 -0.209386 -0.323803 -0.104520 0.035098 0.000027 0.271445 0.013804
polarizability: 1.64828679e+02 2.25455288e+01 1.29187916e+02 1.10981955e+01 -1.11334490e+01 8.19516228e+01
1716.lowfreq: -9.6309 -8.8447 -2.4459 -0.0023 -0.0022 -0.0017 29.3214 44.3917 54.8057
frequency: 29.2328 44.3835 54.8029 76.1963 131.5685 151.8091 170.1561 196.0962 260.0347 279.6179 358.6199 419.8342 427.2423 460.4719 501.5769 528.2439 577.5257 585.3216 643.0886 661.7352 714.3348 745.0524 760.9007 793.8345 824.5415 871.2903 951.2117 968.7522 989.8829 1018.7992 1030.6925 1037.9489 1077.5891 1122.7559 1163.4879 1174.1072 1189.3780 1208.4231 1257.3942 1285.1521 1318.4255 1359.7029 1378.0148 1426.5857 1453.9397 1465.3964 1574.1592 1604.4800 1654.1287 3032.5303 3095.7843 3115.6291 3137.5039 3148.6497 3163.5600 3177.0998 3515.5172
redmass: 9.6835 8.0300 8.1196 8.3876 6.5139 7.2246 9.0252 9.7467 5.7316 4.2917 4.5319 4.0203 3.6463 3.7141 3.6888 3.8158 3.7056 3.2647 1.7899 5.5304 4.7371 4.1479 1.3590 3.0459 3.8753 1.4212 1.4076 1.9915 1.3411 6.3605 3.9755 2.1571 1.9765 1.6876 1.1228 1.0839 1.2606 2.4275 1.4910 1.3530 1.4097 2.2868 4.3314 2.1390 1.3426 1.7688 6.0564 7.1068 8.8459 1.0598 1.1009 1.0901 1.0860 1.0909 1.0955 1.0997 1.0641
irintensity: 0.5778 0.1977 2.1304 1.3146 0.4087 1.0462 1.0491 0.1602 2.1168 2.8904 6.1856 2.6839 4.0485 35.8073 5.4856 24.3893 21.9837 15.6862 155.1339 36.5591 5.8269 26.0061 62.5984 7.0401 5.5787 0.6414 1.8228 3.8872 0.2741 54.8514 161.4902 33.7738 80.4405 6.2906 7.6683 0.8333 8.5026 0.1908 2.3525 2.7300 18.4035 33.0603 5.7560 20.0295 26.2650 26.9699 7.6277 2.4411 181.8388 6.2338 1.5222 0.5706 0.9891 7.4510 10.6955 12.3206 36.4799
temp: 298.150 k
press: 1.00000 atm
elementType: 35 17 8 8 6 6 6 6 6 6 6 6 6 1 1 1 1 1 1 1 1
symmnumber: 1
zpe: 390964.7 jmol-1
zpe.correction: 0.148911 hartree
zpe.thermalcorrener: 0.161632 hartree
zpe.thermalcorrenthalpy: 0.162576 hartree
zpe.thermalcorrgfe: 0.106785 hartree
zpe.sumelectzpe: -970.786248 hartree
zpe.sumelectthermal: -970.773526 hartree
zpe.sumelectthermalent: -970.772582 hartree
zpe.sumelectthermalfe: -970.828373 hartree
dipole: 2.5436 1.5699 0.8527
dipole: 3.1083
quadrupole: -84.5924 -91.0253 -90.6534
quadrupole: 2.2808 -0.2385 4.5320
quadrupole: 4.1646 -2.2683 -1.8964 2.2808 -0.2385 4.5320
hfenergy: -970.9351581 hartree
pointgroup: C01 [X(C9H8Br1Cl1O2)]
dipole: 0.8712992 0.8110222 0.2803216 debye
dipolederiv: -0.5655242 -0.1811246 -0.0021025 -0.2245818 -0.2757741 -0.0371996 -0.0399525 -0.0623956 -0.1123943 -0.1754916 -0.1109493 0.0199464 -0.0791783 -0.6615356 0.1874846 0.0156709 0.1966533 -0.1397311 -0.4274011 0.0052862 0.2204769 0.032154 -0.2942567 -0.2521122 0.2609393 -0.2063488 -1.1415516 -0.3849182 0.1512541 0.0228166 -0.0323257 -0.7247952 0.2645845 0.2044943 0.0471312 -0.7192662 -0.1156185 -0.0908207 0.0490845 -0.1333378 -0.0197525 -0.0019016 -0.0769284 -0.0459553 0.0890421 0.075955 -0.0087611 0.0393211 0.1555581 -0.1917492 0.0919335 0.1788769 0.1056047 -0.0826053 0.8862365 0.2941722 0.0459507 0.2836102 0.027642 -0.0363263 -0.0390638 0.0198912 0.0532629 0.1196725 0.2096478 -0.0137166 0.0789724 0.9112496 -0.3349088 0.0662281 -0.3211676 0.0584713 -0.0341854 0.0093932 0.0540681 -0.0193111 0.0132608 -0.0622454 0.063935 -0.03204 -0.1006724 -0.0847705 -0.1060898 0.0622938 -0.1153737 -0.2459323 0.0189009 0.0353985 0.0133741 -0.0783615 -0.1175379 0.049319 0.005292 0.0507651 0.0734589 -0.0824617 -0.0236644 -0.0758829 -0.1099756 0.2028556 -0.2376576 -0.2763342 -0.0084358 1.0731465 0.0284923 -0.4258089 0.1305468 1.4606764 0.0561344 0.0265727 0.089362 0.0615847 0.0191363 -0.0379582 0.0652593 -0.0633581 -0.0944056 0.0373008 -0.0010654 -0.0493422 0.0191441 0.0631379 0.0999323 -0.0289238 0.042913 0.0076054 0.0371574 0.0107907 0.0015203 -0.0155302 -0.0316405 -0.0624015 0.0144588 -0.0231857 0.0877006 0.0111726 -0.0133897 -0.0563129 -0.0649529 0.0381194 -0.0102113 -0.0311039 0.0080697 0.013579 0.0501856 0.042849 -0.0841603 0.0459261 0.0561258 0.0416147 -0.0753123 0.0462506 0.1063318 0.0421331 0.0327786 -0.0617809 0.0495181 0.0596811 0.0653914 -0.0771171 0.0592431 0.108084 0.0770798 -0.0498916 -0.0102647 -0.0727058 -0.0701296 0.0758703 -0.0118869 0.0748528 0.1243711 -0.0659264 -0.0805164 -0.0585627 -0.0775438 0.0585621 0.0102619 -0.0611502 0.009925 0.13144 0.3754905 0.0482029 0.0024446 0.0660441 0.1220454 0.0332603 -0.0143491 0.0758786 0.338399 unknown
polarizability: 155.5292583|28.4462525|136.4950023|11.3906098|-13.0428942|83.9439571 unknown
InChI: InChI=1S/C9H8BrClO2/c10-7(9(12)13)5-6-3-1-2-4-8(6)11/h1-4,7,12H,5H2
charge 0 multiplicity 1
21 atoms
Br -3.431152 -1.608637 -0.224873
Cl 1.224457 -2.607878 0.695885
O  -2.413955 0.966148 1.869526
O  -2.139848 1.752827 -0.302113
C  -0.712299 -0.743428 -0.962261
C  0.653754 -0.172336 -0.600106
C  -1.689385 -0.62377 0.220308
C  1.61579 -0.903705 0.13867
C  1.015855 1.143582 -0.996276
C  2.882426 -0.387277 0.469786
C  2.278271 1.688077 -0.677191
C  -2.095969 0.812753 0.520348
C  3.214048 0.922611 0.055384
H  -1.133405 -0.20272 -1.826037
H  -0.624151 -1.810775 -1.226898
H  -1.333607 -1.129144 1.129533
H  0.28267 1.736704 -1.553722
H  3.592893 -0.995236 1.036979
H  2.530182 2.703809 -0.998894
H  4.196808 1.335152 0.306555
H  -2.708182 1.902042 2.040397
