program: Gaussian 09
title: 000265258
version: EM64L-G09RevD.01
frameworkgroup: C1[X(C12H14O)]
method: RPBEPBE
basis: SDD
operation: Freq
keyword: #pfreq=noraman
keyword: PBEPBE/SDD
title: #p freq=noraman PBEPBE/SDD
converged: YES YES NO NO
title: Mulliken charges:
elementType: O C C C C C C C C C C C C H H H H H H H H H H H H H H
charge: -0.432860 -0.143510 -0.004166 -0.542316 -0.461933 -0.202890 0.238439 -0.423669 0.326113 -0.532357 -0.432435 -0.403592 -0.224187 0.232218 0.211391 0.230556 0.200208 0.215193 0.244657 0.211765 0.206541 0.220435 0.222855 0.260492 0.232144 0.223198 0.327713
chargesum: 0.00000
title: Mulliken charges with hydrogens summed into heavy atoms:
elementType: O C C C C C C C C C C C C
charge: -0.105147 0.088707 -0.004166 -0.100369 -0.046532 0.041767 0.238439 -0.005363 0.326113 -0.089067 -0.171944 -0.171449 -0.000990
polarizability: 1.46907409e+02 1.19297795e+00 1.41947933e+02 -2.23403423e+00 4.71692382e+00 8.04476145e+01
1716.lowfreq: -5.0782 0.0007 0.0008 0.0011 1.1750 9.4835 89.5072 110.3750 156.2802
frequency: 89.5034 110.3590 156.2785 208.2972 249.2616 263.1878 340.9003 349.0368 400.1453 429.8019 440.5740 484.9322 492.6861 516.3125 569.8711 585.6288 599.8749 660.1890 745.7930 779.1412 787.5501 831.5904 863.4011 876.7926 912.4573 919.1903 945.3551 956.1772 978.1572 1009.1602 1028.0236 1050.8446 1061.1277 1068.5782 1102.4936 1120.8750 1150.6194 1168.0245 1183.2872 1187.4925 1211.7159 1224.6713 1238.1645 1248.6976 1273.2611 1280.8684 1282.8732 1321.9126 1332.4628 1333.8613 1346.6543 1364.4235 1394.5017 1442.6108 1453.8373 1459.2113 1468.5844 1470.2004 1471.6048 1608.1426 1619.6733 2933.2498 2962.2004 2975.8751 2977.3767 2985.0099 3015.3687 3021.2814 3039.0424 3045.5861 3078.4469 3112.4686 3133.1333 3154.0168 3541.0306
redmass: 3.7864 2.3946 3.5057 2.8633 3.4331 1.8516 1.3291 3.1550 3.0423 3.1864 3.5839 4.2560 3.7842 3.4923 3.0530 2.7271 3.4495 3.0164 3.4418 1.5117 2.8700 1.9571 2.2814 2.0497 1.7702 1.8871 1.7115 2.9804 1.3437 2.8943 2.5207 3.4466 1.9665 1.9487 1.7833 1.3622 1.3981 1.3555 1.4695 1.6602 1.4220 1.5001 1.5913 1.3343 1.7998 1.4287 1.2702 1.4406 1.5844 1.5571 1.4453 1.2018 7.0275 2.1930 1.2190 1.2575 1.1873 1.3475 1.5283 7.7157 7.9865 1.0818 1.0626 1.0642 1.0622 1.0650 1.0951 1.0842 1.0986 1.1037 1.0994 1.0871 1.0906 1.0982 1.0657
irintensity: 1.1419 0.2516 0.5546 4.5576 1.6549 2.7969 104.3787 16.2962 0.4216 3.3825 4.8262 4.4548 6.8606 3.0813 7.0330 0.2100 1.0557 4.9013 10.5631 45.9058 3.0954 20.5577 12.7157 5.0711 8.0798 1.1875 10.0533 8.5216 0.4984 36.7403 25.1576 26.0226 3.2308 6.7168 1.5735 3.0578 0.1271 0.4117 0.7641 11.1342 12.4713 0.6995 0.6202 4.6423 12.0195 1.4745 0.1913 3.5840 0.6655 1.1822 3.6889 48.0952 2.3973 4.4908 9.2626 5.7806 12.5830 5.1148 24.2997 0.5740 7.9346 17.2217 29.1799 26.5350 30.3140 46.1560 34.0065 18.7094 64.9885 56.0468 57.6452 8.1676 16.0004 28.7927 5.3976
temp: 298.150 k
press: 1.00000 atm
elementType: 8 6 6 6 6 6 6 6 6 6 6 6 6 1 1 1 1 1 1 1 1 1 1 1 1 1 1
symmnumber: 1
zpe: 601093.5 jmol-1
zpe.correction: 0.228944 hartree
zpe.thermalcorrener: 0.239446 hartree
zpe.thermalcorrenthalpy: 0.240391 hartree
zpe.thermalcorrgfe: 0.193344 hartree
zpe.sumelectzpe: -539.951598 hartree
zpe.sumelectthermal: -539.941096 hartree
zpe.sumelectthermalent: -539.940152 hartree
zpe.sumelectthermalfe: -539.987198 hartree
dipole: -2.6099 -0.1112 0.6971
dipole: 2.7036
quadrupole: -82.6643 -73.5261 -75.7101
quadrupole: 3.0082 1.0258 1.6373
quadrupole: -5.3641 3.7741 1.5901 3.0082 1.0258 1.6373
hfenergy: -540.1805422 hartree
pointgroup: C01 [X(C12H14O1)]
dipole: -1.0284481 0.0320133 -0.2696705 debye
polarizability: 146.9525385|-1.1152569|141.913858|1.8829023|4.7926014|80.4365601 unknown
InChI: InChI=1S/C12H14O/c13-11-7-9-5-1-3-8-4-2-6-10(11)12(8)9/h2,4,6,9,11,13H,1,3,5,7H2
charge 0 multiplicity 1
27 atoms
O  3.23531 0.961481 -0.496186
C  -0.404172 1.482157 0.376033
C  -0.175631 -0.012251 0.224413
C  0.973317 2.063431 -0.068071
C  -1.694266 1.891096 -0.364241
C  2.016516 0.961162 0.328015
C  1.199839 -0.32867 0.24252
C  -2.850375 0.970126 0.120547
C  -1.171347 -0.979887 -0.004469
C  -2.616624 -0.532374 -0.20912
C  1.623918 -1.66513 0.117609
C  -0.742476 -2.327975 -0.131426
C  0.631158 -2.66623 -0.053606
H  -0.545957 1.719173 1.453849
H  0.989438 2.180394 -1.171084
H  1.207616 3.042013 0.38376
H  -1.552303 1.778788 -1.458533
H  -1.949539 2.950257 -0.170585
H  2.411223 1.135716 1.345892
H  -3.810841 1.294158 -0.322959
H  -2.949879 1.092141 1.218213
H  -2.888891 -0.717841 -1.269131
H  -3.305315 -1.157013 0.393333
H  2.688562 -1.922864 0.132168
H  -1.482699 -3.118677 -0.30951
H  0.932178 -3.715686 -0.152233
H  2.980138 0.713408 -1.4222
