program: Gaussian 09
title: 000265255
version: EM64L-G09RevD.01
frameworkgroup: C1[X(C11H17NO)]
method: RPBEPBE
basis: SDD
operation: Freq
keyword: #p
keyword: freq=noraman
keyword: PBEPBE/SDD
title: #p freq=noraman PBEPBE/SDD
converged: YES YES NO NO
title: Mulliken charges:
elementType: O N C C C C C C C C C C C H H H H H H H H H H H H H H H H H
charge: -0.289888 -0.146700 0.219262 -0.275067 -0.209960 -0.541532 -0.538804 -0.238344 -0.238096 -0.786081 0.211252 -0.617555 -0.648657 0.295104 0.233947 0.239771 0.217628 0.246972 0.240706 0.241558 0.239324 0.223806 0.243415 0.233220 0.285829 0.218522 0.217146 0.226276 0.270388 0.226559
chargesum: 0.00000
title: Mulliken charges with hydrogens summed into heavy atoms:
elementType: O N C C C C C C C C C C C
charge: -0.289888 -0.146700 0.219262 0.020037 0.023987 -0.084133 -0.051126 0.003214 0.001228 -0.085639 0.211252 0.103941 0.074566
polarizability: 1.42274814e+02 2.91422365e+00 1.11135129e+02 2.77565385e+00 4.60765353e+00 1.05923116e+02
1716.lowfreq: -15.2444 -4.8822 -0.0004 -0.0002 0.0008 9.0978 57.8520 82.1393 123.9659
frequency: 57.7487 82.1151 123.9134 137.8248 143.9649 179.6101 218.7395 252.2171 278.7346 288.5822 304.7660 339.1288 386.5485 401.9169 453.6668 475.6559 490.7809 534.2829 641.0094 689.5270 713.5774 729.4076 753.7145 795.4573 817.1248 854.2374 901.8656 910.1372 921.2588 932.1036 939.0166 950.3765 972.2007 983.3232 1018.2614 1046.5073 1065.7145 1077.6682 1088.1813 1094.3111 1106.9909 1126.1924 1145.0015 1147.5765 1166.0410 1197.2607 1222.4071 1237.1264 1241.8820 1260.3612 1270.7038 1284.5183 1323.8136 1367.4625 1391.6177 1405.0956 1441.2312 1460.2598 1471.6540 1475.0987 1477.7169 1481.2619 1486.5656 1497.5473 1501.5642 1556.9479 1581.6269 2955.3689 2965.1968 2983.4716 2995.6814 3016.7662 3023.5119 3037.5978 3058.4022 3072.7335 3075.8083 3085.5453 3097.3197 3120.6640 3120.8444 3148.8905 3154.9335 3182.3771
redmass: 3.1500 2.4207 2.2009 1.1177 2.7736 2.2447 1.1581 3.0483 3.3711 2.2603 2.7782 2.5239 2.0661 3.1518 2.7975 3.4099 2.0362 3.5613 4.6538 3.8040 6.0893 1.6641 4.1080 2.9996 3.7310 2.4311 2.2287 2.2775 1.7008 2.0868 2.0967 1.8911 2.1069 1.6987 1.3814 1.3814 1.3521 1.7646 1.2544 1.2232 1.4831 1.6015 1.4574 1.5959 3.0057 1.6781 2.1049 2.5205 1.8670 1.3767 1.6780 1.4749 1.7604 2.6235 1.2579 1.1885 1.1869 1.0709 1.0624 1.0763 1.0575 1.0921 1.0520 1.0823 1.1573 5.9770 5.6988 1.0400 1.0367 1.0358 1.0590 1.1006 1.0596 1.1014 1.1052 1.0902 1.0986 1.0993 1.1065 1.0902 1.0964 1.0872 1.0918 1.1097
irintensity: 3.0678 0.0824 0.2888 0.1517 1.8996 0.5156 0.8800 0.4554 2.9911 5.1960 1.0613 1.0737 2.8387 16.4812 1.5191 3.0998 2.2333 2.2474 5.1891 5.6160 2.9396 60.4226 1.2469 5.2633 7.0918 5.5553 1.3520 1.1437 3.5397 2.3294 6.5097 1.4260 1.5712 3.8001 22.6524 12.2321 26.7837 102.5792 17.7445 0.8892 2.5020 3.5785 4.3963 19.4506 1.4728 15.6551 4.5334 25.7458 3.3409 2.3001 3.4620 0.3122 13.8905 63.4291 24.3824 53.4642 7.1586 7.2682 16.7017 1.6887 4.7896 10.8305 13.9099 19.4799 14.3001 212.9956 8.9060 50.8579 111.8584 29.0885 39.9483 38.6664 29.2520 35.4585 18.3205 58.7623 23.6928 25.2279 40.5310 4.8769 2.3382 9.4409 9.2620 25.3410
temp: 298.150 k
press: 1.00000 atm
elementType: 8 7 6 6 6 6 6 6 6 6 6 6 6 1 1 1 1 1 1 1 1 1 1 1 1 1 1 1 1 1
symmnumber: 1
zpe: 678676.3 jmol-1
zpe.correction: 0.258494 hartree
zpe.thermalcorrener: 0.271384 hartree
zpe.thermalcorrenthalpy: 0.272328 hartree
zpe.thermalcorrgfe: 0.220113 hartree
zpe.sumelectzpe: -558.299442 hartree
zpe.sumelectthermal: -558.286552 hartree
zpe.sumelectthermalent: -558.285608 hartree
zpe.sumelectthermalfe: -558.337823 hartree
dipole: -1.2203 -3.7779 -0.7951
dipole: 4.0490
quadrupole: -72.7707 -83.8210 -77.0254
quadrupole: 3.3891 2.1908 -0.6067
quadrupole: 5.1017 -5.9486 0.8469 3.3891 2.1908 -0.6067
hfenergy: -558.5579365 hartree
pointgroup: C01 [X(C11H17N1O1)]
dipole: -0.4803392 1.4759487 0.3584446 debye
polarizability: 142.2106081|-2.6709639|110.8692966|-3.3484887|4.7653611|106.2531543 unknown
InChI: InChI=1S/C11H17NO/c1-11(10(13)12(2)3)7-8-4-5-9(11)6-8/h4-5,8-9H,6-7H2,1-3H3
charge 0 multiplicity 1
30 atoms
O  -1.295385 -1.778061 -0.424729
N  -2.364557 0.180922 0.184958
C  0.12113 0.243697 -0.419579
C  1.286267 -0.842202 -0.557814
C  1.941606 0.322297 1.282654
C  0.602483 1.047178 0.863096
C  1.568099 -1.15468 0.94397
C  2.570181 -0.090057 -0.925565
C  2.968853 0.606163 0.179469
C  0.00243 1.099634 -1.711393
C  -1.221368 -0.524113 -0.208601
C  -3.630969 -0.562219 0.332606
C  -2.483091 1.623802 0.438748
H  0.993312 -1.685372 -1.195764
H  2.26007 0.54262 2.313638
H  -0.125239 0.973475 1.691265
H  0.76964 2.11762 0.642949
H  2.414418 -1.848239 1.080703
H  0.682287 -1.531992 1.483538
H  3.020547 -0.067736 -1.921758
H  3.804235 1.307292 0.263441
H  -0.82052 1.834114 -1.667821
H  0.941614 1.652849 -1.884962
H  -0.180769 0.44684 -2.585025
H  -3.43502 -1.623833 0.122253
H  -4.390528 -0.180662 -0.377672
H  -4.025196 -0.453925 1.361769
H  -3.205616 2.080634 -0.267693
H  -1.521808 2.138998 0.332485
H  -2.856805 1.801957 1.467134
