program: Gaussian 09
title: 000265289
version: EM64L-G09RevD.01
frameworkgroup: C1[X(C17H17N5O4)]
method: RPBEPBE
basis: SDD
operation: Freq
keyword: #p
keyword: freq=noraman
keyword: PBEPBE/SDD
title: #p freq=noraman PBEPBE/SDD
converged: YES YES NO NO
title: Mulliken charges:
elementType: O O O O N N N N N C C C C C C C C C C C C C C C C C H H H H H H H H H H H H H H H H H
charge: -0.226891 -0.252089 -0.307933 -0.445864 -0.174112 -0.078787 -0.045545 -0.062285 -0.609267 -0.160291 -0.173171 -0.102706 -0.003770 -0.151653 -0.411925 0.402637 0.163718 -0.209637 -0.103953 -0.373151 -0.376063 0.165656 -0.225080 -0.218179 -0.362415 -0.231522 0.273445 0.271218 0.300214 0.225024 0.257771 0.236262 0.238794 0.262267 0.371805 0.247098 0.265851 0.233391 0.234568 0.244635 0.232922 0.334637 0.344377
chargesum: 0.00000
title: Mulliken charges with hydrogens summed into heavy atoms:
elementType: O O O O N N N N N C C C C C C C C C C C C C C C C C
charge: -0.226891 -0.252089 -0.307933 -0.074060 -0.174112 -0.078787 -0.045545 -0.062285 0.069747 0.113154 0.098047 0.197508 0.221254 0.106118 0.063131 0.402637 0.163718 0.052630 -0.103953 -0.126053 -0.110212 0.165656 0.008311 0.016389 -0.117779 0.001400
polarizability: 2.82915622e+02 1.05357401e+01 2.35423420e+02 1.26441726e+01 -1.09863526e+01 1.44425452e+02
1716.lowfreq: -6.8509 -5.7601 -0.0002 0.0006 0.0007 3.8301 9.8650 17.6663 38.1335
frequency: 7.5886 17.4520 38.1003 47.8649 61.5437 69.6963 113.4788 129.6923 147.0046 151.2978 161.8687 190.8517 198.6269 220.1964 256.9815 266.9441 278.1138 310.6633 338.9583 351.4260 403.6513 417.9164 453.7990 463.2415 509.1464 518.0729 521.9061 547.6148 550.4479 563.1969 581.2658 593.9304 611.0213 615.6747 631.1721 648.4981 669.1254 687.4489 705.9514 707.7494 718.7318 737.9216 763.4818 766.9734 787.4373 814.7553 833.3645 844.1646 847.9724 856.4143 865.0698 878.5622 909.0683 925.2242 931.3071 936.7408 958.7715 964.4784 978.4567 986.8870 989.7094 998.2195 1002.9756 1019.2937 1022.9579 1029.8026 1035.4646 1049.5513 1083.2646 1119.3770 1133.0104 1174.0659 1179.7846 1183.7196 1186.3268 1203.4854 1214.2689 1218.4813 1233.8633 1251.4043 1254.2219 1266.9666 1289.1459 1298.1042 1301.2132 1313.3524 1314.0449 1318.5370 1321.5499 1336.5546 1346.7401 1356.6152 1380.2372 1380.8705 1383.7695 1388.8002 1426.3128 1435.4583 1459.6497 1472.8686 1479.9217 1543.7128 1578.5518 1592.9709 1613.4469 1632.7538 2965.4029 3008.6757 3034.5331 3073.0362 3083.5145 3087.8595 3104.3879 3125.8626 3133.8468 3145.0597 3155.4600 3167.8153 3168.6639 3227.5451 3503.0184 3539.7870 3694.8530
redmass: 6.4979 5.8474 6.0251 5.0304 5.3983 5.7634 5.6658 4.3929 5.7591 3.6786 5.2084 6.1860 6.6919 5.4391 4.5119 4.5725 5.7453 5.6922 7.7795 6.2886 3.0452 5.3741 3.9980 4.9888 8.8548 1.2277 4.8911 1.0524 4.3814 4.1184 1.8054 2.8633 3.3896 4.3620 4.9162 4.7675 8.2211 6.7674 4.7677 3.2345 6.0237 1.5943 5.4203 4.5665 2.5824 2.7212 6.7232 3.5446 7.3687 3.1775 1.4198 3.0650 3.6978 3.5086 1.4367 1.6194 2.5764 3.2290 4.4818 1.3884 6.0996 4.3827 1.3472 3.4075 3.2809 2.6835 3.1180 2.8234 1.5803 2.5797 3.9098 1.0530 1.9821 1.2244 1.1522 1.8636 2.8952 2.5271 1.2446 2.2768 1.3275 1.3311 1.4859 3.3666 1.4955 1.2385 4.5697 1.2835 1.3069 1.4481 1.2704 2.5333 1.2471 2.6330 7.9320 1.4754 3.0731 2.1930 3.8693 1.0791 2.2752 8.1425 1.8874 6.2528 6.0729 2.7116 1.0839 1.0638 1.0870 1.0878 1.0868 1.0899 1.1014 1.0855 1.0876 1.0922 1.0960 1.0922 1.1013 1.0979 1.0655 1.0443 1.1056
irintensity: 0.1936 0.1805 1.3479 0.3498 0.4785 0.9589 0.4184 9.0124 5.0719 3.8835 0.9391 1.3433 0.8173 6.0510 7.2660 6.6482 10.0970 6.7171 7.1239 1.1938 0.3011 1.3895 7.5070 2.2220 2.4459 264.0125 4.4654 0.2059 4.5778 0.1375 61.7228 53.5502 38.2961 18.3170 2.2609 57.4744 1.6939 16.2992 36.1688 7.3685 12.7270 93.4574 45.6925 57.4842 18.2505 2.2955 7.8519 6.0017 27.7401 22.7518 2.0644 48.1656 65.2823 32.2829 13.0792 43.8296 1.1788 36.2552 94.3697 0.3654 4.4642 80.9695 2.8766 39.7587 106.6898 13.7764 107.5965 18.2288 3.3623 3.6081 21.6609 0.0077 67.2801 20.9455 9.6663 0.5722 53.1944 119.8188 1.2434 18.7051 11.3717 6.2768 32.9323 43.1095 39.3518 0.8126 34.0449 3.8739 10.6913 4.8704 27.8654 87.4880 43.6386 0.9891 1.1894 16.1515 83.3909 11.0303 20.7435 5.1820 4.3662 68.2178 38.8249 0.6244 0.1486 638.6288 38.5752 26.1784 25.9462 4.9789 4.1639 32.2747 26.1285 1.3936 1.5358 14.4600 24.9309 14.5813 16.6662 0.5229 21.8851 135.0812 49.3582
temp: 298.150 k
press: 1.00000 atm
elementType: 8 8 8 8 7 7 7 7 7 6 6 6 6 6 6 6 6 6 6 6 6 6 6 6 6 6 1 1 1 1 1 1 1 1 1 1 1 1 1 1 1 1 1
symmnumber: 1
zpe: 867888.8 jmol-1
zpe.correction: 0.330561 hartree
zpe.thermalcorrener: 0.351707 hartree
zpe.thermalcorrenthalpy: 0.352651 hartree
zpe.thermalcorrgfe: 0.277596 hartree
zpe.sumelectzpe: -1230.758390 hartree
zpe.sumelectthermal: -1230.737244 hartree
zpe.sumelectthermalent: -1230.736300 hartree
zpe.sumelectthermalfe: -1230.811355 hartree
dipole: 0.2573 -0.5506 1.1450
dipole: 1.2963
quadrupole: -135.1230 -152.0264 -154.4626
quadrupole: -15.5049 -1.0325 -7.3816
quadrupole: 12.0810 -4.8224 -7.2586 -15.5049 -1.0325 -7.3816
hfenergy: -1231.0889515 hartree
pointgroup: C01 [X(C17H17N5O4)]
dipole: 0.1279689 0.0768816 -0.4876762 debye
polarizability: 280.9454004|-17.162893|225.6740585|-7.0873371|-32.9949973|156.1450349 unknown
InChI: InChI=1S/C17H17N5O4/c18-14-11-15(20-7-19-14)22(8-21-11)16-13-12(10(6-23)24-16)25-17(26-13)9-4-2-1-3-5-9/h1-5,7-8,10,12-13,16-17,23H,6,18H2
charge 0 multiplicity 1
43 atoms
O  -0.439858 1.01233 0.738248
O  -1.288287 -0.334232 -2.218473
O  -2.644579 1.481275 -1.597645
O  -3.010453 3.656132 0.160156
N  1.718403 0.466166 -0.257723
N  3.78468 1.472196 -0.347834
N  2.404652 -1.785916 0.540821
N  4.838758 -1.949021 0.864842
N  6.316239 -0.151354 0.453723
C  -0.368707 0.667502 -1.662937
C  -1.247931 1.92025 -1.352055
C  0.262298 0.250014 -0.295251
C  -0.953146 2.268236 0.127092
C  -2.653525 0.009224 -1.796937
C  -2.185532 2.726537 0.935835
C  -3.118265 -0.755893 -0.563304
C  2.646463 -0.499411 0.163641
C  2.464113 1.626476 -0.545778
C  3.911476 0.141028 0.096769
C  -4.21761 -0.276157 0.190982
C  -2.513998 -1.986851 -0.213985
C  5.040748 -0.645944 0.472315
C  -4.692469 -1.011368 1.298998
C  -2.989088 -2.719752 0.896574
C  3.559821 -2.436822 0.876192
C  -4.07686 -2.233832 1.656915
H  0.402032 0.829828 -2.431975
H  -1.070082 2.773111 -2.02509
H  0.109399 -0.818718 -0.076143
H  -0.159811 3.045263 0.152889
H  -3.305717 -0.180442 -2.668062
H  -1.874434 3.282829 1.83321
H  -2.748059 1.824714 1.243773
H  2.001172 2.549597 -0.888103
H  -3.424445 3.129917 -0.575501
H  -4.698083 0.669095 -0.087269
H  -1.680747 -2.36728 -0.814059
H  -5.538361 -0.630373 1.881719
H  -2.508032 -3.665805 1.167574
H  3.452797 -3.477813 1.194727
H  -4.443203 -2.801971 2.519052
H  7.084116 -0.758207 0.733559
H  6.484514 0.811542 0.170422
