program: Gaussian 09
title: 000265323
version: EM64L-G09RevD.01
frameworkgroup: C1[X(C22H28O6)]
method: RPBEPBE
basis: SDD
operation: Freq
keyword: #pfreq=noraman
keyword: PBEPBE/SDD
title: #p freq=noraman PBEPBE/SDD
converged: NO YES NO NO
title: Mulliken charges:
elementType: O O O O O O C C C C C C C C C C C C C C C C C C C C C C H H H H H H H H H H H H H H H H H H H H H H H H H H H H
charge: -0.267755 -0.254641 -0.416438 -0.225231 -0.418412 -0.200931 0.321351 -0.173424 -0.083014 -0.212148 -0.085402 -0.481758 -0.491694 -0.489546 -0.515210 -0.505888 -0.795649 0.285144 -0.568517 0.304112 -0.430011 -0.565924 -0.370067 -0.395242 0.382325 0.192309 -0.395364 0.191404 0.197148 0.211966 0.212821 0.248632 0.227933 0.223695 0.261098 0.193418 0.206598 0.196986 0.209664 0.234054 0.206215 0.206954 0.209779 0.241423 0.207700 0.225098 0.236120 0.226390 0.259653 0.240260 0.267667 0.230280 0.379115 0.277387 0.244266 0.383302
chargesum: 0.00000
title: Mulliken charges with hydrogens summed into heavy atoms:
elementType: O O O O O O C C C C C C C C C C C C C C C C C C C C C C
charge: -0.267755 -0.254641 -0.037323 -0.225231 -0.035111 -0.200931 0.321351 0.023724 0.128952 0.000673 0.163231 -0.030130 -0.037178 -0.085962 -0.071492 -0.092719 -0.136746 0.285144 -0.107299 0.304112 -0.203621 -0.306271 0.137861 -0.164962 0.382325 0.192309 0.126288 0.191404
polarizability: 2.99147357e+02 -1.87189490e+01 2.37805090e+02 6.71236190e-01 9.95840860e+00 2.07887103e+02
1716.lowfreq: -4.8495 0.0007 0.0008 0.0011 7.0909 12.2964 15.4819 22.1797 29.7470
frequency: 13.3218 21.9163 29.6686 33.7669 36.1225 43.7207 56.4375 88.8269 91.6501 115.2684 131.6454 138.0552 149.1370 161.2199 193.7931 204.7124 218.2066 235.2280 253.6494 259.8222 269.0920 286.3428 295.8065 313.9156 336.1933 347.5575 387.5057 414.3143 420.0152 438.2676 441.8541 455.8556 469.1992 477.5782 486.4876 488.3890 531.3709 540.4002 546.0514 555.4208 558.1393 603.4431 610.5593 625.3617 627.5291 635.4926 649.6978 675.8341 690.2518 706.4973 738.2217 774.6722 799.0271 812.6069 815.0778 821.1098 825.6067 841.0848 850.9606 871.3496 892.5339 912.7124 917.9527 938.8596 948.9847 961.6057 967.0693 982.0609 994.1611 1000.3331 1002.7601 1006.2767 1015.4716 1019.2548 1020.8129 1035.8599 1056.0072 1065.4033 1079.1577 1084.9155 1092.5128 1104.7441 1121.3354 1133.9299 1139.2743 1154.5685 1166.5721 1178.4697 1193.9570 1202.7773 1207.1454 1226.8059 1227.6563 1234.5678 1239.4524 1248.6576 1251.3016 1254.8559 1256.1149 1265.0757 1272.4631 1278.7219 1289.4379 1295.9190 1308.9518 1309.8399 1325.5687 1330.2981 1343.0687 1344.7700 1350.8443 1353.7744 1356.8015 1363.3412 1370.3624 1372.5409 1377.0191 1389.9876 1422.2301 1429.1089 1444.3904 1455.2022 1460.1574 1468.1319 1469.7403 1473.8330 1478.3531 1487.4474 1493.1480 1498.7026 1580.0992 1621.8234 1677.7073 1692.8765 2913.1465 2932.8962 2949.2775 2963.5342 2971.0048 2973.6940 2978.4643 2980.6171 2992.4416 2993.4050 2995.4909 2997.1308 3013.3923 3018.0946 3032.2876 3035.3992 3052.6876 3054.6894 3061.2551 3063.5329 3075.6973 3077.3685 3087.4704 3137.2774 3139.3039 3159.3717 3512.3153 3518.6838
redmass: 7.5186 7.2179 7.0707 8.3696 5.8332 7.4295 5.3990 4.0409 5.1061 2.9615 3.2381 2.5740 1.2230 3.4739 3.5631 2.8271 3.3716 3.5104 3.8488 3.4162 2.6290 3.8990 4.2970 3.6269 3.0712 3.1779 3.2471 3.5192 2.9371 2.8861 2.6687 4.1662 2.9134 2.6143 2.7585 1.9952 4.2738 3.9130 3.6110 3.6681 3.0423 4.7074 4.8694 1.4609 1.4632 3.5766 3.7685 3.0244 2.4895 4.6811 3.0656 2.1761 2.9653 1.6355 1.6225 4.1483 4.4257 2.2163 2.3699 3.5687 1.5648 2.2407 2.1305 1.4078 2.2293 2.5265 2.0541 2.6680 2.0187 2.5513 2.1858 2.2144 3.0531 2.5057 2.4998 2.3351 2.8158 2.6880 1.8833 1.7869 3.6194 1.8859 1.9162 1.7432 2.0899 1.4444 1.6886 1.5474 1.9733 1.4063 1.5369 1.4060 1.3080 1.2221 1.5813 1.4080 1.6146 1.5126 1.5104 1.4437 1.8316 1.3605 1.5515 1.3849 1.5626 1.3570 1.3952 1.4337 1.4984 1.5120 1.5067 1.4487 1.5015 1.4342 1.7302 1.3933 3.4884 1.2016 3.7126 1.0790 1.0863 1.1068 1.0901 1.0871 1.0955 1.0763 1.0597 1.6221 1.0888 1.3878 7.0189 6.8844 8.6526 9.0238 1.0811 1.0820 1.0800 1.0656 1.0627 1.0421 1.0798 1.0638 1.0602 1.0655 1.0630 1.0595 1.0955 1.0674 1.1005 1.0963 1.1019 1.1008 1.0938 1.0976 1.0979 1.0989 1.1025 1.0861 1.0913 1.0951 1.0642 1.0643
irintensity: 0.3379 1.2286 0.6620 1.1458 0.6177 0.0280 0.7195 1.1508 1.4441 2.6858 0.5833 1.1705 0.6793 1.0023 2.4622 1.1668 1.6154 1.3164 1.2775 0.5898 0.9057 0.1220 0.9216 2.0807 2.6349 7.4798 0.5746 5.5953 7.0717 13.7359 3.5556 11.0986 25.3029 5.2975 8.8427 37.5828 11.7641 10.3567 8.3004 6.0978 7.0680 9.3773 17.8006 162.6917 81.1292 19.6851 24.8583 6.0917 2.7734 3.9183 0.6264 9.4558 2.6317 11.7075 23.0469 4.5291 2.7905 1.4989 3.4201 8.0442 28.1146 5.2103 9.2351 2.6141 10.3752 9.6841 0.3175 9.1363 8.4246 175.8882 56.0809 37.9438 457.3203 121.1114 106.8358 12.3704 17.9483 4.7218 1.5718 4.2600 31.9069 5.2442 8.0033 9.7421 14.6245 21.6059 27.6839 2.3280 19.0026 5.5041 4.8239 21.9960 2.8794 1.1766 97.2420 2.7617 14.2852 5.0579 2.6824 7.7137 28.8070 6.8576 4.2170 2.8322 2.7361 0.0530 5.1295 3.5878 1.8486 1.0398 3.6390 9.9739 14.4697 6.7308 1.1853 12.3182 9.1875 20.1490 16.0643 27.6054 33.8992 8.2508 1.3709 16.8057 6.8220 9.2319 7.9849 108.5599 7.5508 31.6482 22.7511 59.6771 186.3373 197.1173 25.6379 22.0064 28.5709 29.4711 55.2909 26.9801 31.6147 45.5636 54.9456 16.3526 35.6217 45.3389 37.4151 23.7974 52.5748 51.0043 20.1400 33.5952 10.5447 42.4035 7.9453 30.5300 32.1000 18.4381 4.4546 19.1384 22.5653 27.4036
temp: 298.150 k
press: 1.00000 atm
elementType: 8 8 8 8 8 8 6 6 6 6 6 6 6 6 6 6 6 6 6 6 6 6 6 6 6 6 6 6 1 1 1 1 1 1 1 1 1 1 1 1 1 1 1 1 1 1 1 1 1 1 1 1 1 1 1 1
symmnumber: 1
zpe: 1215279.5 jmol-1
zpe.correction: 0.462876 hartree
zpe.thermalcorrener: 0.489185 hartree
zpe.thermalcorrenthalpy: 0.490129 hartree
zpe.thermalcorrgfe: 0.403826 hartree
zpe.sumelectzpe: -1304.359037 hartree
zpe.sumelectthermal: -1304.332728 hartree
zpe.sumelectthermalent: -1304.331784 hartree
zpe.sumelectthermalfe: -1304.418087 hartree
dipole: -0.8471 1.0480 0.2419
dipole: 1.3691
quadrupole: -151.7956 -153.9970 -162.5421
quadrupole: 0.3757 -14.3710 4.9581
quadrupole: 4.3159 2.1146 -6.4305 0.3757 -14.3710 4.9581
hfenergy: -1304.8219129 hartree
pointgroup: C01 [X(C22H28O6)]
dipole: 0.3325843 0.4118828 -0.0994361 debye
polarizability: 299.3776808|17.2638105|238.1688206|-4.8890552|-9.7932064|207.2930487 unknown
InChI: InChI=1S/C22H28O6/c1-22-9-8-16-15-5-3-14(27-11-20(23)24)10-13(15)2-4-17(16)18(22)6-7-19(22)28-12-21(25)26/h3,5,10,16-19,23,25H,2,4,6-9,11-12H2,1H3
charge 0 multiplicity 1
56 atoms
O  -3.76122 1.40083 -0.347422
O  5.014755 0.08944 0.630268
O  -6.411991 3.234574 1.459477
O  -6.378417 0.984068 0.867704
O  6.019819 3.188766 -1.088274
O  4.367553 2.909336 0.533028
C  -2.681977 -0.823055 -0.367276
C  -1.830736 -1.619007 0.682097
C  -0.921349 -2.694849 0.016518
C  -0.028313 -2.163864 -1.146977
C  -3.260824 0.310197 0.522619
C  -1.739221 -0.248841 -1.467365
C  -1.170656 -0.504702 1.566038
C  -0.898815 -1.353524 -2.146793
C  -2.118318 0.73651 1.483584
C  -0.056962 -3.52833 0.994717
C  -3.832497 -1.647797 -0.986749
C  1.261045 -1.476381 -0.658925
C  1.14201 -2.753717 1.587752
C  1.846618 -1.830872 0.596341
C  1.963315 -0.560761 -1.479343
C  3.09056 -1.278401 0.972143
C  -4.430346 2.469835 0.351946
C  3.202085 0.004361 -1.103346
C  3.76775 -0.368758 0.135415
C  -5.815208 2.095762 0.891881
C  5.786409 0.98709 -0.199564
C  5.269651 2.429039 -0.173709
H  -2.544818 -2.174598 1.329858
H  -1.629007 -3.409672 -0.4569
H  0.314811 -3.072028 -1.69382
H  -4.121099 -0.096489 1.093575
H  -1.05819 0.50273 -1.023791
H  -2.347166 0.286534 -2.218814
H  -0.170669 -0.237373 1.189505
H  -1.046698 -0.849375 2.607771
H  -1.573969 -2.067152 -2.659178
H  -0.279259 -0.910326 -2.948318
H  -2.498171 1.029542 2.478619
H  -1.584334 1.607597 1.05976
H  0.327207 -4.405945 0.435787
H  -0.68445 -3.92608 1.816833
H  -4.451619 -2.114007 -0.196595
H  -4.490639 -0.988241 -1.580744
H  -3.468731 -2.454665 -1.647295
H  1.874646 -3.470133 2.008089
H  0.801751 -2.139165 2.443888
H  1.542173 -0.266865 -2.445923
H  3.549156 -1.544532 1.931129
H  -3.833001 2.870035 1.198239
H  -4.561058 3.29041 -0.375382
H  3.687946 0.721982 -1.771989
H  -7.314645 2.998745 1.807286
H  6.804455 0.985002 0.226791
H  5.858024 0.644406 -1.250304
H  5.728234 4.139813 -1.051063
