program: Gaussian 09
title: 000265307
version: EM64L-G09RevD.01
frameworkgroup: C1[X(C18H22N2O4S)]
method: RPBEPBE
basis: SDD
operation: Freq
keyword: #p
keyword: freq=noraman
keyword: PBEPBE/SDD
title: #p freq=noraman PBEPBE/SDD
converged: YES YES NO NO
title: Mulliken charges:
elementType: S O O O O N N C C C C C C C C C C C C C C C C C C H H H H H H H H H H H H H H H H H H H H H H
charge: 0.950243 -0.554069 -0.530091 -0.283463 -0.335219 -0.549732 -0.355550 -0.389229 -0.324979 -0.432800 -0.046102 -0.266521 -0.230992 0.449850 -0.374758 -0.359080 0.345341 -0.800302 -0.483765 0.464144 -0.396006 -0.382815 -0.226319 -0.218485 -0.244070 0.246669 0.251382 0.219962 0.201979 0.372009 0.265403 0.228553 0.295003 0.280030 0.323578 0.242471 0.242055 0.244133 0.229165 0.228185 0.253507 0.223210 0.229705 0.271269 0.224130 0.274528 0.227844
chargesum: 0.00000
title: Mulliken charges with hydrogens summed into heavy atoms:
elementType: S O O O O N N C C C C C C C C C C C C C C C C C C
charge: 0.950243 -0.554069 -0.530091 -0.283463 -0.335219 -0.177722 -0.031972 0.108822 0.096962 0.061156 -0.046102 0.028481 0.049038 0.449850 -0.132288 -0.117024 0.345341 -0.098819 -0.007048 0.464144 -0.166302 -0.111546 -0.002189 0.056042 -0.016226
polarizability: 3.15563984e+02 3.52779175e+00 2.31345998e+02 -1.53315229e+00 2.19937333e+01 1.89366154e+02
1716.lowfreq: -5.1000 -3.1441 -0.0028 -0.0004 0.0016 6.3006 13.4590 23.3241 28.6511
frequency: 13.1694 23.3126 28.4992 33.7887 35.1927 39.6393 49.4648 62.5885 87.8901 102.1670 107.0952 130.0565 131.6072 145.5154 159.6989 202.8734 216.3293 218.4423 248.6374 270.0107 274.3052 302.8777 311.2521 321.4181 352.5172 363.6288 390.8132 403.7233 406.0273 408.7845 420.0441 446.8281 493.2541 511.8610 529.7158 552.1414 574.2314 593.1100 599.8406 616.2560 623.0704 635.7669 701.3102 710.0341 710.9985 756.1282 776.0707 782.7622 800.1875 814.8404 825.0156 831.6170 848.2053 853.8496 864.9447 888.6286 930.5865 936.7557 940.1381 960.1380 976.4424 984.4256 985.2297 989.3018 989.9592 990.8744 997.1289 1008.9323 1023.3200 1031.0217 1049.3636 1057.2414 1089.4390 1090.9191 1108.8519 1117.2415 1118.9178 1172.0081 1183.5947 1186.3023 1198.4489 1217.5508 1219.7282 1221.2080 1231.3803 1247.3532 1292.3671 1296.3923 1325.2881 1339.2671 1344.8368 1352.0565 1368.9152 1381.3850 1384.9813 1391.2460 1399.1430 1416.3368 1440.5810 1444.3530 1464.5544 1469.7713 1471.8145 1473.8770 1474.8615 1480.9456 1482.6894 1494.1380 1591.8190 1595.6726 1597.1086 1612.5447 1629.5751 2974.3834 2980.4301 2987.0328 3016.9823 3042.4954 3044.6033 3056.8276 3062.6496 3082.9449 3090.5850 3115.7175 3120.1004 3130.0281 3133.6617 3135.2739 3148.3909 3153.3330 3157.4114 3159.2943 3166.2340 3170.6186 3569.1587
redmass: 6.0784 5.0380 4.8579 1.4170 2.0636 4.2967 5.5025 4.7596 5.0176 5.7868 4.5264 7.2195 5.6655 6.1598 5.4299 5.3438 3.0694 5.8290 5.2474 5.7313 4.1389 4.6555 3.6332 3.4678 2.8828 2.6786 3.9555 5.2707 2.8905 3.4642 4.0830 4.3153 3.3915 3.1969 3.0277 1.3277 3.2116 4.3334 4.4191 6.1964 6.9356 5.0280 6.8528 2.0643 3.2197 1.9798 4.4502 1.8697 9.4003 3.5137 1.4022 2.8313 4.1327 1.2503 1.2575 2.4934 6.2685 1.7666 2.1248 1.3268 1.7303 1.4163 1.3866 1.5075 1.6992 5.7371 4.3931 1.3928 2.0245 1.9376 1.5900 2.5114 2.8924 1.5064 2.2148 1.4102 2.6604 1.0564 1.1420 1.1299 1.6661 2.8796 2.7853 1.2414 1.1581 1.4970 1.1222 1.2616 1.2669 1.2541 1.2709 1.3653 1.2746 5.9466 8.1967 3.0210 1.2258 1.1468 2.1704 1.0995 1.1412 1.1152 1.1121 1.0914 2.1049 2.1756 1.1383 1.8248 6.0516 6.9706 6.0508 6.1700 6.9449 1.0618 1.0386 1.0618 1.0622 1.0982 1.0586 1.1013 1.0952 1.1033 1.1000 1.0884 1.1063 1.0897 1.0892 1.0894 1.0921 1.0951 1.0776 1.0949 1.0963 1.1002 1.0776
irintensity: 1.5012 0.5272 1.1228 0.1805 0.2477 1.7222 0.6436 0.3193 0.6416 2.4523 1.6857 11.1076 4.7217 3.3906 0.7546 2.6005 6.4351 26.5684 4.9092 5.1738 2.4629 2.0901 1.5097 3.3766 4.6624 17.7396 3.4237 8.7423 0.3467 8.4352 44.9553 52.7768 9.2924 48.3207 14.2251 163.4475 13.1402 29.2980 31.1791 0.1176 0.8486 4.2236 22.0177 62.7877 4.1528 70.8779 6.2844 10.2530 88.4144 15.5937 29.7956 5.4341 33.3329 5.9205 4.9001 125.4693 104.7239 44.1518 12.2417 0.8621 2.4752 2.8115 0.7731 2.8995 22.6242 0.9162 3.2041 1.9517 8.7267 92.6477 22.8923 36.6702 2.0632 7.3457 4.5818 18.5930 23.3343 1.4996 13.0352 6.0371 156.2847 2.7660 26.5513 17.4526 4.5868 153.5490 22.5778 2.5332 1.4837 6.1986 8.8540 2.6488 2.9441 0.2424 2.0390 10.1151 15.5424 33.3068 18.1098 29.9173 19.3880 21.0072 16.4857 14.2370 27.9283 8.5609 9.7710 296.2551 3.2680 0.2802 9.3560 1.8169 220.4629 17.5386 27.7812 34.0738 48.1712 24.4977 35.5956 49.1574 18.6066 15.4637 15.3447 1.8636 8.5716 17.5997 15.7884 11.7038 12.8708 29.0729 464.8529 3.2703 3.6578 8.4166 40.0622
temp: 298.150 k
press: 1.00000 atm
elementType: 16 8 8 8 8 7 7 6 6 6 6 6 6 6 6 6 6 6 6 6 6 6 6 6 6 1 1 1 1 1 1 1 1 1 1 1 1 1 1 1 1 1 1 1 1 1 1
symmnumber: 1
zpe: 977172.7 jmol-1
zpe.correction: 0.372185 hartree
zpe.thermalcorrener: 0.397488 hartree
zpe.thermalcorrenthalpy: 0.398432 hartree
zpe.thermalcorrgfe: 0.312980 hartree
zpe.sumelectzpe: -1505.567637 hartree
zpe.sumelectthermal: -1505.542334 hartree
zpe.sumelectthermalent: -1505.541390 hartree
zpe.sumelectthermalfe: -1505.626842 hartree
dipole: 2.2370 3.0852 -6.5022
dipole: 7.5367
quadrupole: -116.6250 -145.9850 -161.8161
quadrupole: -1.5905 -3.1404 0.8503
quadrupole: 24.8504 -4.5096 -20.3407 -1.5905 -3.1404 0.8503
hfenergy: -1505.9398221 hartree
pointgroup: C01 [X(C18H22N2O4S1)]
dipole: 0.9016088 -0.4079941 2.7951452 debye
polarizability: 309.6667945|19.7299452|243.6119574|5.3429993|14.0390664|182.9973844 unknown
InChI: InChI=1S/C18H22N2O4S/c1-15-8-10-17(11-9-15)25(22,23)20-13-5-12-19-18(21)24-14-16-6-3-2-4-7-16/h2-4,6-11,19-20H,5,12-14H2,1H3
charge 0 multiplicity 1
47 atoms
S  1.300415 0.645481 -1.092889
O  0.1383 1.756615 -0.75767
O  1.578112 0.179378 -2.625145
O  -3.289015 -2.775002 0.157767
O  -1.220255 -2.445096 -0.925048
N  1.073517 -0.925501 -0.1410
N  -1.3564 -3.177563 1.295214
C  0.527353 -0.704217 1.2294
C  0.743754 -1.98113 2.075055
C  0.100054 -3.26793 1.495909
C  2.888504 1.304234 -0.322243
C  2.810844 2.465216 0.461288
C  4.094448 0.640307 -0.601179
C  5.256627 2.339705 0.760711
C  4.011407 2.975521 1.005204
C  5.279537 1.169434 -0.046246
C  -1.894529 -2.77073 0.09919
C  6.544587 2.916552 1.319743
C  -3.986359 -2.053685 -0.976625
C  -4.130396 -0.582204 -0.659866
C  -5.31042 -0.087511 -0.047312
C  -3.068512 0.316872 -0.941852
C  -5.425347 1.281825 0.28123
C  -3.172648 1.682306 -0.597598
C  -4.35438 2.167198 0.01074
H  1.085381 0.123746 1.704563
H  -0.543019 -0.41505 1.213747
H  1.830825 -2.165212 2.170133
H  0.34611 -1.788572 3.091444
H  0.405457 -1.501134 -0.714211
H  0.558564 -3.506711 0.52087
H  0.305053 -4.115006 2.175142
H  1.843203 2.952727 0.62077
H  4.105372 -0.252689 -1.233607
H  -2.001319 -3.362655 2.064256
H  3.979135 3.880514 1.622811
H  6.234954 0.670167 -0.245291
H  7.03126 3.579474 0.578373
H  7.269296 2.123101 1.573222
H  6.361188 3.517227 2.227193
H  -3.396004 -2.229439 -1.891536
H  -4.95653 -2.570735 -1.031379
H  -6.13623 -0.775687 0.173272
H  -2.156601 -0.050383 -1.424105
H  -6.343383 1.657374 0.747532
H  -2.325005 2.343823 -0.803222
H  -4.441808 3.22805 0.272548
