program: Gaussian 09
title: 000265250
version: EM64L-G09RevD.01
frameworkgroup: C1[X(C16H21N)]
method: RPBEPBE
basis: SDD
operation: Freq
keyword: #pfreq=noraman
keyword: PBEPBE/SDD
title: #p freq=noraman PBEPBE/SDD
converged: YES YES NO NO
title: Mulliken charges:
elementType: N C C C C C C C C C C C C C C C C H H H H H H H H H H H H H H H H H H H H H
charge: -0.363550 -0.016723 0.448554 0.448587 0.325471 0.325467 -0.535884 -0.535901 -0.420139 -0.420126 -0.420604 -0.420617 -0.254428 -0.807387 -0.807378 -0.692609 -0.692573 0.249529 0.206541 0.249525 0.206530 0.237641 0.237641 0.242727 0.242727 0.224807 0.230279 0.238052 0.237335 0.230279 0.238062 0.237332 0.225044 0.221794 0.218585 0.218583 0.221791 0.225034
chargesum: 0.00000
title: Mulliken charges with hydrogens summed into heavy atoms:
elementType: N C C C C C C C C C C C C C C C C
charge: -0.363550 -0.016723 0.448554 0.448587 0.325471 0.325467 -0.079813 -0.079845 -0.182498 -0.182484 -0.177877 -0.177890 -0.029621 -0.101722 -0.101705 -0.027186 -0.027165
polarizability: 2.02341780e+02 3.55438544e-02 1.72035873e+02 -3.79077072e-03 5.04807557e+00 1.45877291e+02
1716.lowfreq: -14.8150 -3.9699 -0.0006 0.0001 0.0005 3.9417 34.1379 37.1656 59.2486
frequency: 34.1004 36.8520 59.2007 66.7488 67.2437 87.4080 103.1155 113.9430 137.3503 157.4807 192.5247 221.1955 223.7875 224.2264 283.2589 288.8137 304.9149 343.3405 371.3135 384.4260 446.2574 491.4377 532.5913 533.3312 558.6593 594.5780 617.8626 642.2289 651.0589 707.3310 746.3685 766.7645 772.2558 784.5337 789.6435 812.4305 833.3947 868.9343 911.4839 961.1957 965.5777 971.8301 981.4291 990.6464 1007.6499 1029.9508 1030.0711 1039.7918 1043.9794 1046.7330 1059.2058 1064.9033 1080.7732 1110.5122 1178.6963 1214.3356 1227.0913 1237.4675 1250.3438 1261.8987 1271.9859 1313.3970 1314.6932 1328.3715 1334.6551 1372.4142 1385.6715 1386.1441 1391.2699 1401.9611 1406.1354 1455.6854 1459.9134 1460.3292 1464.5175 1468.6163 1471.9295 1474.0774 1475.8662 1476.2916 1477.0705 1487.5418 1488.4045 1538.3230 1573.4759 1594.6794 1598.4615 2964.2945 2965.6970 2980.8662 2980.9769 2988.4274 2988.5373 3030.8666 3031.2754 3057.1496 3057.3665 3079.3403 3079.5272 3086.3049 3086.5966 3089.1959 3089.4903 3115.2182 3123.8450 3151.4052 3197.2105 3218.3195
redmass: 2.5037 2.5535 3.4626 2.0790 3.4192 1.0311 1.6155 2.4299 3.2413 2.4679 1.5728 1.1196 1.7168 3.2157 3.0919 2.9836 2.1856 3.4068 3.0752 3.5947 3.0907 3.1068 3.9462 4.5702 3.3809 4.1352 3.1857 3.4910 5.6044 3.9525 4.7562 1.2078 1.8281 1.1857 1.2613 2.2650 1.3284 2.8722 1.3710 2.2035 1.5792 2.2483 1.3415 4.8581 2.0740 2.1628 1.5170 1.4198 1.4550 1.4598 2.1202 1.9837 1.6133 1.5027 1.1497 1.4081 3.5558 1.4346 1.6897 2.1037 1.4726 2.4071 1.5158 1.8631 6.1126 4.3333 1.2211 1.3750 2.3177 1.2213 1.3059 2.2635 1.0511 1.0495 2.4247 1.1113 1.1700 1.0561 1.2607 1.0748 1.0771 1.0955 1.1041 4.9559 5.3444 7.3461 6.1450 1.0386 1.0384 1.0348 1.0348 1.0650 1.0649 1.0972 1.0973 1.0966 1.0966 1.0994 1.0993 1.1009 1.1008 1.0964 1.0962 1.0855 1.0915 1.0991 1.0923 1.1038
irintensity: 0.3130 0.0436 0.0518 0.0046 0.0119 0.0330 0.1971 0.4181 0.0027 2.3147 0.1496 0.7643 0.9026 0.7030 0.0136 0.3693 3.0549 11.1737 3.6471 0.1146 1.7678 1.0344 1.1218 0.2787 1.0377 2.8624 0.3849 0.5780 2.2691 2.6682 0.3121 65.5754 22.2024 9.1426 10.3615 26.8769 0.0244 14.7734 0.0097 1.9564 0.0496 0.8014 0.3367 10.0074 1.7178 3.4771 2.0178 0.1348 8.8057 6.6639 22.0831 1.0130 0.1863 4.7486 2.4236 4.9552 0.0076 0.4317 2.1261 0.8155 3.7608 4.5556 1.4393 11.9067 3.8005 0.9366 11.9125 6.7423 72.5698 26.1868 8.9537 7.1473 0.0682 24.9265 73.9583 5.9817 0.0204 0.7217 5.1904 12.9075 8.2760 16.3138 9.3662 6.2491 3.7193 8.9635 0.0424 73.5957 19.2488 75.4200 1.4302 52.0491 0.3860 0.0244 47.8825 0.5191 0.0021 72.9921 17.5669 19.8667 67.0174 6.6013 34.2310 0.0499 24.4896 34.2145 9.2087 6.9960
temp: 298.150 k
press: 1.00000 atm
elementType: 7 6 6 6 6 6 6 6 6 6 6 6 6 6 6 6 6 1 1 1 1 1 1 1 1 1 1 1 1 1 1 1 1 1 1 1 1 1
symmnumber: 1
zpe: 853836.2 jmol-1
zpe.correction: 0.325209 hartree
zpe.thermalcorrener: 0.343399 hartree
zpe.thermalcorrenthalpy: 0.344343 hartree
zpe.thermalcorrgfe: 0.278318 hartree
zpe.sumelectzpe: -675.798473 hartree
zpe.sumelectthermal: -675.780283 hartree
zpe.sumelectthermalent: -675.779339 hartree
zpe.sumelectthermalfe: -675.845364 hartree
dipole: 1.8634 0.0025 0.0001
dipole: 1.8634
quadrupole: -101.7609 -99.2983 -100.4720
quadrupole: -0.0035 -0.0032 1.8115
quadrupole: -1.2505 1.2121 0.0384 -0.0035 -0.0032 1.8115
hfenergy: -676.1236824 hartree
pointgroup: C01 [X(C16H21N1)]
dipole: -0.7330995 0.0000481 -0.0002205 debye
polarizability: 202.3418173|0.0039282|171.4915232|0.0161857|-6.2789416|146.4216044 unknown
InChI: InChI=1S/C16H21N/c1-5-14-8-7-9-15(6-2)16(14)17-12(3)10-11-13(17)4/h7-11H,5-6H2,1-4H3
charge 0 multiplicity 1
38 atoms
N  0.927212 -0.000021 -0.000076
C  -0.519486 -0.000373 -0.000543
C  -1.215801 1.158659 -0.453525
C  -1.215702 -1.159613 0.452115
C  1.74071 0.253602 1.127223
C  1.741609 -0.252596 -1.12696
C  -0.488631 2.420717 -0.902566
C  -0.488466 -2.421468 0.901652
C  -2.632932 1.133764 -0.451929
C  -2.63284 -1.135097 0.449832
C  3.072081 0.158682 0.703619
C  3.07264 -0.157788 -0.702264
C  -3.339623 -0.000766 -0.001228
C  1.166957 0.558949 2.482496
C  1.168977 -0.557353 -2.482841
C  -0.57376 3.561876 0.146493
C  -0.572867 -3.562792 -0.147286
H  0.573676 2.201534 -1.104883
H  -0.935624 2.777703 -1.851343
H  0.573694 -2.20207 1.104497
H  -0.935878 -2.77844 1.850236
H  -3.180662 2.016034 -0.805425
H  -3.180505 -2.017498 0.803101
H  3.943054 0.304263 1.341833
H  3.944125 -0.303073 -1.339847
H  -4.43549 -0.000912 -0.001485
H  0.510618 1.450643 2.472627
H  0.563833 -0.27755 2.886462
H  1.989074 0.752982 3.191466
H  0.512991 -1.449313 -2.473989
H  0.565822 0.279139 -2.886781
H  1.991702 -0.750647 -3.191306
H  -0.088794 3.263538 1.09319
H  -0.064516 4.469768 -0.224967
H  -1.623809 3.823702 0.371296
H  -1.622759 -3.824821 -0.372587
H  -0.063665 -4.470547 0.224567
H  -0.087467 -3.264522 -1.093776
