program: Gaussian 09
title: 000265312
version: EM64L-G09RevD.01
frameworkgroup: C1[X(C17H26N2O3S)]
method: RPBEPBE
basis: SDD
operation: Freq
keyword: #p
keyword: freq=noraman
keyword: PBEPBE/SDD
title: #p freq=noraman PBEPBE/SDD
converged: YES YES NO NO
title: Mulliken charges:
elementType: S O O O N N C C C C C C C C C C C C C C C C C H H H H H H H H H H H H H H H H H H H H H H H H H H
charge: 0.214959 -0.393793 -0.184797 -0.278598 -0.356362 0.023021 0.430992 0.050553 -0.523064 -0.495638 -0.526233 -0.517453 0.332640 -0.662530 -0.596033 -0.750449 -0.760586 -0.746521 0.164680 0.209321 -0.140139 -0.486853 -0.166736 0.172877 0.240193 0.218300 0.204785 0.207403 0.221681 0.208227 0.221382 0.216909 0.247878 0.249161 0.265957 0.267299 0.210806 0.210003 0.217755 0.211576 0.218539 0.218299 0.211015 0.208891 0.218558 0.381513 0.384904 0.266726 0.258981
chargesum: 0.00000
title: Mulliken charges with hydrogens summed into heavy atoms:
elementType: S O O O N N C C C C C C C C C C C C C C C C C
charge: 0.214959 -0.008889 -0.184797 -0.278598 0.025152 0.023021 0.430992 0.223430 -0.064571 -0.083450 -0.096326 -0.079163 0.332640 -0.165491 -0.062778 -0.111885 -0.112172 -0.108056 0.164680 0.209321 -0.140139 -0.220127 0.092245
polarizability: 2.98304013e+02 1.38133371e+00 2.15391941e+02 -2.56731112e+01 -5.16154256e+00 1.64128620e+02
1716.lowfreq: -11.5413 -3.4466 -0.0017 -0.0011 -0.0004 4.3829 10.9443 19.4629 29.9190
frequency: 10.5008 19.0293 29.8205 33.4316 48.6055 74.5886 92.0799 94.7027 119.2555 131.8303 157.7478 170.7077 178.7447 198.4868 208.6807 218.8386 232.7277 247.3825 259.6442 274.4517 289.9388 297.9463 326.2005 341.1350 344.0957 378.0807 392.7596 414.6222 433.3680 435.5226 464.1356 467.0713 487.6357 507.1602 530.5693 535.5930 552.4343 565.6893 594.9180 616.3049 660.9775 684.7170 703.1102 709.9525 746.8861 773.3792 779.2443 806.1816 813.9244 832.6379 856.3683 861.4803 861.9265 878.7655 887.8497 906.9273 917.2613 923.0118 927.7324 931.8403 939.4875 970.6835 977.6395 990.6994 1012.5538 1023.7424 1031.4485 1042.3756 1062.8672 1073.0941 1098.2234 1100.7707 1124.8834 1135.9733 1140.4946 1155.9483 1198.4736 1209.8777 1216.3320 1227.2801 1238.7491 1242.1916 1254.4474 1262.1596 1277.8748 1279.9666 1292.8353 1304.9330 1316.7422 1325.2556 1328.1613 1334.4069 1339.0038 1350.3046 1366.6413 1375.6292 1377.6774 1402.2240 1455.0218 1458.0043 1458.3156 1461.1523 1463.7856 1464.7874 1467.8730 1472.4387 1478.9171 1481.1757 1486.4405 1490.0576 1497.6276 1529.8974 1577.3989 1614.1851 1654.1838 2916.9443 2961.5165 2966.7399 2969.6511 2974.4018 2978.4379 2980.4675 2987.9656 3002.9651 3016.5819 3021.0904 3039.6025 3044.3723 3048.2467 3057.6674 3061.2162 3066.2961 3068.2686 3073.0026 3073.3920 3075.3087 3105.5225 3199.7870 3252.2083 3253.0825 3495.7969
redmass: 10.0035 5.5661 4.8117 2.6793 5.4163 8.4083 6.7248 4.5648 3.6758 4.7530 4.0727 2.2354 2.2117 2.7042 2.9074 3.1313 1.0789 1.3282 2.2893 6.4317 5.1471 3.3096 2.2817 2.6867 2.3876 2.1011 2.9764 2.3168 2.1431 2.6682 2.7163 2.7161 2.4191 3.6463 5.7007 4.7195 3.3035 3.8246 4.9721 2.4494 2.6506 2.9202 3.6323 1.3512 2.6964 3.1967 1.7441 4.3130 2.6397 5.5417 2.8088 1.9708 1.5109 1.5377 2.3137 3.1133 2.0433 1.6861 1.7411 1.4579 1.2386 2.1210 1.9537 2.4171 1.6194 1.4791 2.1649 2.0217 1.9566 1.8319 1.6965 2.0052 2.2137 1.6768 1.6584 2.2018 2.3901 1.5740 1.5905 2.1549 1.6293 2.5123 2.0381 1.3801 1.6064 1.4442 1.5977 1.3241 1.4146 1.5387 1.4119 1.6242 1.5558 1.6314 1.4630 1.2001 1.1979 1.2067 1.1001 1.0879 1.0718 1.0942 4.8740 1.0486 1.0552 1.0887 1.0814 1.0746 1.0629 1.0667 1.0589 2.3709 3.8145 7.4353 3.4748 1.0820 1.0597 1.0356 1.0354 1.0374 1.0649 1.0603 1.0642 1.0608 1.0970 1.0636 1.0954 1.1007 1.1003 1.0995 1.0990 1.0983 1.0992 1.1007 1.0981 1.0978 1.0981 1.0919 1.1003 1.0844 1.0638
irintensity: 0.0506 0.4338 0.1939 0.0242 0.6148 4.0283 2.1523 1.0334 1.5652 2.0296 2.1451 2.5579 0.1102 1.5057 2.6679 1.3632 0.2650 0.0809 0.6905 2.2154 1.6853 1.2199 0.1149 1.0656 1.2628 1.0293 1.5263 3.1165 1.7834 0.3278 1.4272 1.8633 2.5024 4.6547 43.5466 5.9811 31.0276 6.4425 20.7245 37.9652 43.8618 57.8256 7.1577 96.3781 4.3957 7.6597 3.4235 22.9333 1.4426 1.5345 3.0261 67.4150 10.9257 71.9213 3.7587 7.0525 0.7596 2.4060 5.4156 1.1666 0.5090 17.8778 14.3267 4.9092 7.9399 4.1371 44.8683 26.4419 50.1232 23.1348 95.3907 6.0133 125.6698 21.8410 33.1477 45.7972 49.4245 35.7442 11.2569 15.5605 5.2847 15.1854 67.3007 35.8577 1.8431 32.3904 4.6496 1.5873 8.0263 13.8382 5.0308 33.5473 12.5343 22.2121 6.9673 22.7815 25.6564 19.3618 8.1380 7.1536 15.1019 9.5774 0.7040 1.6010 0.3674 22.5549 1.4568 13.9921 7.6124 2.6325 39.9807 797.6290 71.5795 296.8993 101.3247 22.5409 36.0165 27.4134 39.5856 10.3600 14.0351 29.1095 24.0960 17.1527 38.4899 3.2024 25.8497 6.6886 73.1305 2.6089 30.9271 84.0382 26.7463 19.8111 63.3156 64.2654 8.7319 9.8261 8.0735 488.4750 34.8832
temp: 298.150 k
press: 1.00000 atm
elementType: 16 8 8 8 7 7 6 6 6 6 6 6 6 6 6 6 6 6 6 6 6 6 6 1 1 1 1 1 1 1 1 1 1 1 1 1 1 1 1 1 1 1 1 1 1 1 1 1 1
symmnumber: 1
zpe: 1069727.4 jmol-1
zpe.correction: 0.407438 hartree
zpe.thermalcorrener: 0.431593 hartree
zpe.thermalcorrenthalpy: 0.432537 hartree
zpe.thermalcorrgfe: 0.351506 hartree
zpe.sumelectzpe: -1394.880168 hartree
zpe.sumelectthermal: -1394.856013 hartree
zpe.sumelectthermalent: -1394.855069 hartree
zpe.sumelectthermalfe: -1394.936099 hartree
dipole: -3.3406 4.4304 -0.9212
dipole: 5.6246
quadrupole: -142.3342 -149.3467 -145.3622
quadrupole: 6.4853 -9.1148 4.6942
quadrupole: 3.3469 -3.6657 0.3188 6.4853 -9.1148 4.6942
hfenergy: -1395.2876054 hartree
pointgroup: C01 [X(C17H26N2O3S1)]
dipole: 1.575348 -1.5509541 -0.0986434 debye
polarizability: 294.6007259|17.5839855|219.369436|25.58219|1.4827857|163.8544116 unknown
InChI: InChI=1S/C17H26N2O3S/c1-16(2,3)12-4-6-17(7-5-12,11-14(21)22)10-13(20)19-15-18-8-9-23-15/h8-9,12,19,21H,4-7,10-11H2,1-3H3
charge 0 multiplicity 1
49 atoms
S  -4.94791 -1.707705 -0.524846
O  0.803385 -3.148107 0.24176
O  -2.352097 2.133744 0.80367
O  -1.327642 -2.513868 0.849056
N  -2.922048 -0.156316 0.638631
N  -4.861225 0.98008 -0.320103
C  0.434604 0.245386 0.765189
C  3.300911 1.165412 0.15202
C  0.761013 1.562902 -0.000078
C  1.661383 -0.131233 1.648961
C  2.103287 1.524543 -0.769487
C  3.001601 -0.176259 0.875831
C  4.702953 1.204446 -0.572084
C  -0.795624 0.466994 1.713886
C  0.140087 -0.883063 -0.295561
C  5.832221 0.90289 0.454374
C  4.796073 0.175019 -1.7317
C  4.95442 2.62851 -1.14417
C  -2.086975 0.922603 1.015835
C  -0.224661 -2.215013 0.310945
C  -4.152397 -0.085105 -0.007204
C  -6.292593 -0.706215 -1.176179
C  -6.054133 0.640583 -0.97208
H  3.346639 1.952613 0.941035
H  -0.067119 1.819042 -0.687409
H  0.797895 2.382052 0.746059
H  1.742374 0.62981 2.452677
H  1.487061 -1.103066 2.153465
H  2.257272 2.516132 -1.23289
H  2.041889 0.799576 -1.606037
H  2.986977 -1.009763 0.146434
H  3.805175 -0.409926 1.598153
H  -0.975917 -0.446733 2.310361
H  -0.527064 1.278079 2.413471
H  1.020628 -1.019937 -0.939702
H  -0.705158 -0.555596 -0.928394
H  5.754587 1.564953 1.338455
H  6.823289 1.070703 -0.00748
H  5.806153 -0.143789 0.806966
H  5.796859 0.222963 -2.201057
H  4.647445 -0.860739 -1.374831
H  4.050985 0.377053 -2.522883
H  4.857258 3.397914 -0.354146
H  5.976765 2.699183 -1.560911
H  4.24929 2.881534 -1.955841
H  -2.533837 -1.103069 0.815675
H  0.510677 -4.004415 0.660505
H  -7.147567 -1.183027 -1.649433
H  -6.725191 1.44413 -1.277609
