program: Gaussian 09
title: 000265212
version: EM64L-G09RevD.01
frameworkgroup: C1[X(C21H17NO3S)]
method: RPBEPBE
basis: SDD
operation: Freq
keyword: #p
keyword: freq=noraman
keyword: PBEPBE/SDD
title: #p freq=noraman PBEPBE/SDD
converged: YES YES NO NO
title: Mulliken charges:
elementType: S O O O N C C C C C C C C C C C C C C C C C C C C C H H H H H H H H H H H H H H H H H
charge: 0.183468 -0.214794 -0.212315 -0.203059 0.018661 -0.718900 -0.499745 0.668881 0.143140 -0.536918 -0.384378 0.293056 0.384624 -0.155161 -0.201534 -0.385218 -0.338104 -0.346787 -0.239885 -0.243028 -0.247590 -0.227791 -0.210819 -0.210293 -0.220747 -0.224909 0.318985 0.263504 0.249355 0.294679 0.247092 0.235781 0.286980 0.246444 0.280042 0.251348 0.250551 0.233415 0.237047 0.232719 0.232296 0.236442 0.233470
chargesum: 0.00000
title: Mulliken charges with hydrogens summed into heavy atoms:
elementType: S O O O N C C C C C C C C C C C C C C C C C C C C C
charge: 0.183468 -0.214794 -0.212315 -0.203059 0.018661 -0.399915 0.013114 0.668881 0.143140 -0.242239 -0.137287 0.293056 0.384624 -0.155161 0.034247 -0.098238 -0.091660 -0.066746 0.011463 0.007522 -0.014175 0.009256 0.021899 0.022003 0.015695 0.008560
polarizability: 3.29840529e+02 1.80169458e+01 2.31561593e+02 -2.43522087e+01 -1.05189761e+01 2.22979818e+02
1716.lowfreq: -8.9686 -5.1100 -0.0008 0.0005 0.0013 3.6000 8.1891 12.2243 16.0702
frequency: 3.1529 11.5688 15.7872 24.0728 27.0335 37.8938 51.9584 64.9365 87.6385 108.6641 130.6413 151.5544 164.2987 178.5391 194.0846 222.3849 250.8336 276.7295 303.7958 311.6108 375.8814 399.9477 401.2274 403.5071 414.6657 418.2759 426.4333 473.2078 494.0775 514.4877 545.7613 559.4780 599.5976 610.2255 612.8068 618.6547 657.8270 675.6921 681.8007 694.5136 696.7820 697.3696 717.6223 744.2869 754.7021 773.5780 807.1651 822.9826 848.3191 857.6167 860.7414 924.1749 928.0724 938.8158 949.7959 970.6250 976.3515 978.2318 986.0643 989.6457 989.9809 993.4902 996.2679 998.4710 1013.5264 1014.6889 1027.2516 1069.3759 1072.2360 1077.3934 1085.0819 1089.3425 1091.8343 1158.5706 1172.8294 1172.9196 1175.2783 1180.6598 1182.2091 1190.5271 1206.8341 1222.2857 1233.8652 1292.1593 1297.4027 1305.7839 1320.5992 1339.4610 1370.6975 1373.1592 1388.2018 1405.4345 1425.4235 1435.1233 1437.1009 1439.5203 1457.0133 1478.4073 1480.4388 1568.8725 1586.2556 1586.8261 1589.3202 1597.4180 1612.1356 1613.8916 2977.1607 3039.9240 3073.7411 3129.6916 3131.1262 3132.5871 3137.2568 3140.5319 3149.2363 3151.3538 3156.6577 3158.4033 3160.6291 3170.4778 3171.2148 3180.2861 3187.1515
redmass: 6.0145 4.8832 5.8174 6.3410 4.9593 5.3250 10.2456 7.3376 6.1265 6.0833 7.0288 5.3176 5.7018 5.6737 3.6118 3.9265 4.8485 6.1075 7.2227 6.0786 7.6601 5.5119 2.9906 3.2745 3.2338 5.4302 4.0157 4.2446 4.6744 6.8261 3.1940 3.6501 4.2257 6.4704 6.4310 7.0001 7.5538 5.7246 4.5941 2.1789 2.2678 1.8999 6.6032 5.5472 1.5568 1.8768 2.7421 1.9216 1.2467 3.0339 1.4727 1.3774 1.5398 1.5123 1.4312 2.2734 1.4110 4.1505 6.1069 5.9546 5.8315 1.3868 1.3833 1.3257 1.3638 3.2563 2.0683 2.0410 1.8451 2.5464 1.5279 1.7269 2.1349 1.1923 1.0702 1.1724 1.0655 1.1140 1.1816 1.1313 2.9891 3.0566 2.9200 1.4828 1.3282 1.6746 1.3816 1.6069 10.3770 9.7086 9.1147 5.4018 2.0758 1.6785 2.1312 1.5196 2.1041 2.7260 2.1823 6.9480 6.2863 6.0433 6.5240 6.8380 6.3778 6.9801 1.0627 1.0947 1.0867 1.0849 1.0852 1.0880 1.0882 1.0880 1.0930 1.0923 1.0939 1.0967 1.0962 1.1016 1.1014 1.0925 1.0960
irintensity: 0.3041 0.5464 0.4368 1.4506 0.5005 0.2658 0.2167 2.1966 0.3464 6.7820 0.6990 0.0298 2.0313 1.9094 0.7819 3.4813 1.2527 0.9407 5.0238 4.9596 1.8114 0.9797 0.1853 0.6164 0.6597 0.2910 1.0266 10.5884 7.8148 1.1036 5.9817 24.0463 3.2721 0.5503 0.3730 28.0607 10.1409 3.1141 14.0700 70.2382 27.3354 40.8230 1.9904 32.3531 55.0517 55.9580 27.0515 4.2418 0.3547 2.9570 1.9170 2.4452 3.2336 5.8512 6.3078 12.6508 0.2945 56.2503 5.4764 1.9151 4.9869 0.4774 2.1429 0.1897 0.0174 11.8335 0.7030 5.7576 5.0902 1.8821 21.2181 7.1583 19.8520 4.2835 2.8430 19.3300 0.9718 3.2340 0.7755 29.3386 98.4570 236.4818 67.8939 15.1515 1.8868 103.2784 29.2899 41.6161 112.0684 1.0508 3.1105 0.6102 10.2147 15.4994 20.2997 30.1716 22.7157 23.9653 1.2747 95.0773 1.7575 6.6814 4.8451 39.0009 7.9679 2.0101 33.2803 4.7529 4.2670 0.6147 0.3942 6.9520 2.4594 6.1283 14.9774 17.3759 11.1349 22.8221 17.8417 19.5725 21.1190 3.4589 4.4189
temp: 298.150 k
press: 1.00000 atm
elementType: 16 8 8 8 7 6 6 6 6 6 6 6 6 6 6 6 6 6 6 6 6 6 6 6 6 6 1 1 1 1 1 1 1 1 1 1 1 1 1 1 1 1 1
symmnumber: 1
zpe: 852226.7 jmol-1
zpe.correction: 0.324596 hartree
zpe.thermalcorrener: 0.347700 hartree
zpe.thermalcorrenthalpy: 0.348644 hartree
zpe.thermalcorrgfe: 0.264441 hartree
zpe.sumelectzpe: -1487.020805 hartree
zpe.sumelectthermal: -1486.997702 hartree
zpe.sumelectthermalent: -1486.996757 hartree
zpe.sumelectthermalfe: -1487.080961 hartree
dipole: -4.0733 -3.9432 3.5527
dipole: 6.6905
quadrupole: -127.6404 -178.7829 -151.2292
quadrupole: -9.5314 -0.5114 10.8350
quadrupole: 24.9104 -26.2321 1.3217 -9.5314 -0.5114 10.8350
hfenergy: -1487.3454015 hartree
pointgroup: C01 [X(C21H17N1O3S1)]
dipole: 1.5514678 1.7495894 1.2085652 debye
polarizability: 328.7515682|25.3168771|235.690063|18.8316224|9.9959084|219.9403093 unknown
InChI: InChI=1S/C21H17NO3S/c23-20(16-8-3-1-4-9-16)15-21(26-19-12-5-2-6-13-19)17-10-7-11-18(14-17)22(24)25/h1-14,21H,15H2
charge 0 multiplicity 1
43 atoms
S  -0.997246 2.576092 0.607934
O  1.851952 -0.424095 -1.483196
O  -2.549108 -4.580956 0.455551
O  -2.361084 -3.329631 -1.440412
N  -2.184851 -3.513093 -0.175027
C  -0.03641 1.029664 -0.044112
C  1.458655 1.360178 0.128421
C  -0.485738 -0.233098 0.666173
C  2.358336 0.398361 -0.664607
C  -1.104686 -1.268413 -0.068705
C  -0.310479 -0.396564 2.066448
C  3.843371 0.475019 -0.464368
C  -1.527253 -2.43388 0.605046
C  -2.701753 2.145067 0.043018
C  -0.731081 -1.575076 2.720341
C  -1.348923 -2.613462 1.992824
C  4.453194 1.446392 0.375925
C  4.66437 -0.459721 -1.153521
C  -3.05866 2.309961 -1.316517
C  -3.652836 1.681307 0.981353
C  5.85606 1.480398 0.522768
C  6.063897 -0.428032 -1.001955
C  -4.371471 1.998055 -1.738644
C  -4.968062 1.381112 0.555243
C  6.66364 0.543053 -0.163091
C  -5.327389 1.535084 -0.803685
H  -0.270672 0.957171 -1.117878
H  1.652734 2.390624 -0.23582
H  1.743906 1.350539 1.197021
H  -1.250193 -1.189613 -1.14917
H  0.137883 0.415262 2.650656
H  -0.584996 -1.68361 3.800045
H  -1.691129 -3.536395 2.467655
H  3.842785 2.181034 0.911418
H  4.1762 -1.197411 -1.79905
H  -2.320072 2.688414 -2.031582
H  -3.363437 1.556432 2.029703
H  6.320178 2.233304 1.168848
H  6.68888 -1.15388 -1.533097
H  -4.646801 2.121673 -2.791723
H  -5.704856 1.021687 1.281921
H  7.752689 0.569211 -0.04547
H  -6.344642 1.296037 -1.13278
