program: Gaussian 09
title: 000265297
version: EM64L-G09RevD.01
frameworkgroup: C1[X(C17H18N4O7)]
method: RPBEPBE
basis: SDD
operation: Freq
keyword: #p
keyword: freq=noraman
keyword: PBEPBE/SDD
title: #p freq=noraman PBEPBE/SDD
converged: YES YES NO NO
title: Mulliken charges:
elementType: O O O O O O O N N N N C C C C C C C C C C C C C C C C C H H H H H H H H H H H H H H H H H H
charge: -0.309422 -0.442995 -0.433146 -0.428605 -0.283113 -0.228193 -0.240299 -0.281990 -0.060645 -0.394126 -0.416624 -0.122289 -0.199112 -0.153531 -0.032628 -0.376249 0.335920 0.196793 -0.062306 0.151079 0.136965 -0.474587 0.424493 -0.390932 -0.362970 -0.227161 -0.230877 -0.228046 0.291741 0.308008 0.277120 0.262878 0.215710 0.231774 0.353149 0.367463 0.383061 0.348714 0.365592 0.230400 0.258039 0.253036 0.277378 0.237347 0.237449 0.235735
chargesum: 0.00000
title: Mulliken charges with hydrogens summed into heavy atoms:
elementType: O O O O O O O N N N N C C C C C C C C C C C C C C C C C
charge: -0.309422 -0.089846 -0.065683 -0.079891 -0.283113 -0.228193 -0.240299 -0.281990 -0.060645 -0.011065 -0.051033 0.169452 0.108897 0.123589 0.230249 0.071235 0.335920 0.196793 -0.062306 0.151079 0.136965 0.013852 0.424493 -0.137895 -0.085592 0.010186 0.006571 0.007690
polarizability: 2.49794773e+02 1.31635627e+01 2.51288683e+02 2.31230928e+00 1.34050278e+01 1.85620589e+02
1716.lowfreq: -14.6711 -5.2601 -2.4902 0.0005 0.0007 0.0008 4.7681 14.5765 23.4792
frequency: -14.0403 13.0925 23.3711 30.6934 43.4891 55.2000 66.3131 91.6504 101.0224 112.1442 122.2240 137.5100 168.2689 172.1061 179.6158 186.8411 227.9784 234.2738 241.5748 264.0882 291.3147 315.1181 333.7977 335.5033 340.6331 347.7862 365.3623 379.1267 384.4926 404.2437 418.5730 439.1894 448.9232 485.1774 513.4345 529.8130 541.4929 585.8739 609.3245 615.9694 616.4263 634.8952 650.7171 668.9360 695.8301 700.3083 706.4906 709.0243 738.2928 757.9456 765.3401 769.9528 780.3862 813.2242 814.7648 847.5236 858.6239 873.6523 891.3629 927.6050 936.6958 962.4072 968.8630 975.7844 982.6738 990.6617 994.1462 1002.0974 1004.1474 1023.6724 1026.3137 1041.2513 1063.0648 1067.4552 1089.7654 1093.9610 1108.2371 1162.4885 1176.2629 1183.4214 1192.2549 1202.0074 1211.8693 1220.5393 1224.6273 1232.1499 1243.7044 1257.1787 1267.5765 1272.0991 1297.7726 1313.6517 1319.0687 1326.7089 1332.7863 1340.9016 1347.3020 1361.0782 1364.4616 1380.2782 1385.7692 1387.7860 1389.6149 1442.1618 1455.0865 1464.0423 1484.0712 1498.5586 1534.2221 1591.8656 1592.5237 1612.2502 1666.2189 1675.7744 2978.2286 3017.5100 3039.4529 3052.2308 3077.8758 3079.0800 3084.4176 3125.2704 3127.6146 3134.4642 3147.0046 3158.1860 3170.4498 3521.1959 3527.5583 3531.5312 3568.9337 3572.5261
redmass: 6.2326 6.3700 6.3583 6.4045 4.4852 8.1192 6.3375 5.1577 5.4712 7.0223 4.7245 6.7831 3.0349 6.6936 6.1016 5.9818 2.7838 3.1301 2.4432 5.1199 6.8314 2.9306 4.9197 2.3163 3.6414 2.9769 2.8862 1.3102 5.8300 2.7432 5.4170 4.4085 4.6203 4.4236 7.8432 5.4191 6.0009 5.2161 5.4797 4.7128 6.3021 4.3939 4.0622 1.8171 4.3379 2.6740 2.6581 2.9842 3.5937 3.4771 2.8124 2.9568 2.9149 6.2180 3.7195 7.5204 1.2538 8.0410 3.4797 3.1268 1.4753 2.9600 3.3667 1.9362 1.4551 5.0031 3.3245 3.9664 1.3460 3.6449 2.2374 3.6344 3.4576 6.5277 2.0339 1.5437 7.5866 1.1388 1.0555 1.2352 1.1237 1.2759 2.2466 2.1691 1.4610 2.0387 1.9963 2.8560 2.1152 1.4850 1.8344 1.6915 1.4248 1.2798 1.2990 1.5740 1.2434 1.2504 1.5842 1.2785 7.1712 2.0484 1.9738 2.1439 1.0819 1.2282 2.3509 4.3802 5.9413 6.3693 8.9575 5.9623 8.1396 6.5509 1.0666 1.0850 1.0875 1.0582 1.0871 1.0873 1.0979 1.0936 1.1031 1.0878 1.0919 1.0965 1.1015 1.0783 1.0772 1.0668 1.0661 1.0669
irintensity: 1.5034 0.1842 0.7533 0.6435 1.1305 1.6920 1.7112 3.2982 2.8993 0.3259 4.5417 6.9534 2.5056 0.9366 7.5338 3.2898 56.6675 35.9746 30.8641 7.1728 9.4499 10.9800 7.0264 75.6826 29.5640 0.2618 61.5673 164.7798 6.0809 1.5416 27.2924 21.4099 6.1038 7.0805 2.2653 1.9668 13.7614 10.3041 41.0275 7.8677 0.4519 0.7775 38.0041 41.3188 9.2627 1.4776 73.5057 32.8118 44.9719 92.5936 41.3063 97.4589 29.2976 44.6851 9.7035 6.1545 1.7478 163.0348 60.2685 103.5024 2.2309 73.7052 15.0896 13.5212 1.9046 0.8767 35.9865 69.6312 1.1721 64.4286 1.8313 60.3843 12.9274 13.8538 30.2581 6.8005 83.4109 7.8643 0.0142 27.1662 4.1182 30.9827 48.0152 24.2421 10.3321 75.5099 156.0794 17.6889 47.2223 39.6217 7.6122 42.6606 1.8147 31.0761 7.0711 3.8482 15.1020 15.6753 37.8525 14.9808 3.9980 43.6059 6.6944 7.3809 5.7753 13.8556 8.5419 112.5018 375.2573 3.6484 6.9672 1.8583 642.4687 617.2566 29.8498 20.3917 16.8272 31.8732 0.8601 12.6831 13.0887 1.6033 5.2889 2.7566 13.3609 15.6389 15.2719 150.0682 54.2140 52.7220 8.1395 17.1316
temp: 298.150 k
press: 1.00000 atm
elementType: 8 8 8 8 8 8 8 7 7 7 7 6 6 6 6 6 6 6 6 6 6 6 6 6 6 6 6 6 1 1 1 1 1 1 1 1 1 1 1 1 1 1 1 1 1 1
symmnumber: 1
zpe: 909357.9 jmol-1
zpe.correction: 0.346356 hartree
zpe.thermalcorrener: 0.370918 hartree
zpe.thermalcorrenthalpy: 0.371862 hartree
zpe.thermalcorrgfe: 0.290328 hartree
zpe.sumelectzpe: -1402.120650 hartree
zpe.sumelectthermal: -1402.096088 hartree
zpe.sumelectthermalent: -1402.095144 hartree
zpe.sumelectthermalfe: -1402.176678 hartree
dipole: -3.7602 -4.4490 -3.9508
dipole: 7.0386
quadrupole: -171.1168 -186.4616 -153.7218
quadrupole: -3.8139 -13.2681 11.8674
quadrupole: -0.6834 -16.0282 16.7116 -3.8139 -13.2681 11.8674
hfenergy: -1402.4670057 hartree
pointgroup: C01 [X(C17H18N4O7)]
dipole: -1.4854696 -1.6672948 -1.6376407 debye
polarizability: 244.0727805|16.5327097|248.5896926|-7.9284638|22.6075716|194.0415714 unknown
InChI: InChI=1S/C17H18N4O7/c22-6-9-11(23)12(24)15(28-9)21-13-10(14(25)20-16(26)19-13)18-17(21)27-7-8-4-2-1-3-5-8/h1-5,9,11-12,15,19-20,22-24H,6-7H2
charge 0 multiplicity 1
46 atoms
O  2.302743 -1.497007 -0.764324
O  0.927442 -3.016747 -2.967579
O  -0.857977 -2.927585 0.174741
O  3.817329 -3.075555 1.174048
O  -1.703968 -0.068502 -1.509339
O  0.390444 4.540505 0.831274
O  4.597428 2.460355 0.620275
N  0.644614 0.215454 -1.015891
N  -0.793615 1.93831 -0.50015
N  2.762071 1.264606 -0.212453
N  2.459781 3.446749 0.653134
C  1.284596 -0.968447 -1.666535
C  0.331425 -2.161829 -1.935963
C  0.366147 -2.98451 -0.613154
C  1.62945 -2.486729 0.152135
C  2.651275 -3.584387 0.452743
C  1.400531 1.24639 -0.440774
C  -0.690456 0.718954 -1.020737
C  0.522547 2.290304 -0.131166
C  1.024687 3.512414 0.477401
C  3.364227 2.403598 0.372439
C  -3.106158 0.396148 -1.125023
C  -3.423459 0.021025 0.301912
C  -3.778882 -1.316141 0.625005
C  -3.352103 0.992149 1.334407
C  -4.059379 -1.676957 1.960888
C  -3.642424 0.631383 2.669248
C  -3.994667 -0.701704 2.984725
H  1.817102 -0.636159 -2.575798
H  -0.694364 -1.854485 -2.19414
H  0.461271 -4.046019 -0.891628
H  1.343331 -1.959874 1.08299
H  2.93934 -4.083468 -0.495852
H  2.194748 -4.32674 1.129122
H  0.714467 -2.662859 -3.867378
H  -1.13972 -1.991153 0.345022
H  3.3244 0.415066 -0.318613
H  4.312368 -2.457801 0.578632
H  2.883957 4.279324 1.074835
H  -3.724089 -0.145646 -1.857306
H  -3.149352 1.483525 -1.297829
H  -3.84131 -2.071933 -0.167349
H  -3.050074 2.015594 1.087398
H  -4.327255 -2.711106 2.202033
H  -3.58778 1.38667 3.460508
H  -4.216186 -0.980383 4.020966
