program: Gaussian 09
title: 000265216
version: EM64L-G09RevD.01
frameworkgroup: C1[X(C22H22N2O3S2)]
method: RPBEPBE
basis: SDD
operation: Freq
keyword: #p
keyword: freq=noraman
keyword: PBEPBE/SDD
title: #p freq=noraman PBEPBE/SDD
converged: YES YES NO NO
title: Mulliken charges:
elementType: S S O O O N N C C C C C C C C C C C C C C C C C C C C C C H H H H H H H H H H H H H H H H H H H H H H
charge: 0.509606 0.892732 -0.578796 -0.532187 -0.248585 -0.586411 -0.453288 -0.812181 -0.821114 0.514119 0.504174 -0.062790 -0.346699 -0.357279 -0.404411 -0.400167 -0.238289 -0.211317 0.498186 -0.322684 -0.428024 -0.216515 -0.215904 -0.216686 -0.226642 -0.229765 -0.233056 0.225530 -0.779745 0.280815 0.321393 0.351116 0.273620 0.283769 0.259774 0.233949 0.235619 0.282949 0.272986 0.316925 0.225840 0.233905 0.234602 0.230642 0.231373 0.233447 0.234885 0.304599 0.213375 0.261309 0.261296
chargesum: 0.00000
title: Mulliken charges with hydrogens summed into heavy atoms:
elementType: S S O O O N N C C C C C C C C C C C C C C C C C C C C C C
charge: 0.509606 0.892732 -0.578796 -0.532187 -0.248585 -0.586411 -0.148689 -0.209972 -0.196378 0.514119 0.504174 -0.062790 -0.062930 -0.097505 -0.170462 -0.164548 0.044660 0.061669 0.498186 -0.005759 -0.202183 0.017391 0.018697 0.013956 0.004730 0.003682 0.001829 0.225530 -0.043765
polarizability: 5.04666893e+02 3.83803766e+01 3.17091234e+02 -5.61919434e-01 2.03943225e+01 2.20665875e+02
1716.lowfreq: -6.3877 -0.0001 0.0007 0.0009 0.5109 2.1838 6.1735 10.3652 16.5587
frequency: 4.1860 10.0247 16.4808 19.0495 25.9551 28.4276 40.4114 44.0011 49.0625 68.8457 72.7087 79.4015 94.6730 98.3219 123.8218 143.2922 158.4959 160.0924 173.1352 190.3557 210.0328 243.2441 270.8787 280.7441 318.9156 336.3113 339.9073 345.5124 354.6954 385.4890 397.2686 403.5212 404.4576 414.3936 439.9002 459.3023 483.9914 519.4143 525.6353 546.8794 554.1471 560.2868 590.9804 597.1706 608.8865 615.9140 617.7115 620.5774 631.5019 650.7250 677.7681 703.3723 705.1534 734.8290 773.1084 774.0082 779.5910 807.8071 809.2749 823.7704 830.2341 857.1124 857.6498 874.5018 893.9244 897.9119 905.4248 931.6716 932.3632 939.9254 955.9136 983.1705 984.2112 988.6064 989.9771 990.2305 995.6483 1001.9868 1002.2877 1005.1777 1025.4900 1027.4681 1040.2076 1061.7581 1075.1642 1082.5691 1118.8295 1124.6213 1151.0270 1175.0036 1175.6309 1181.7664 1189.2378 1192.1102 1214.4751 1215.1845 1223.8231 1229.8044 1245.3235 1262.5881 1294.8726 1327.6561 1332.0663 1371.6143 1383.4879 1386.2826 1389.9650 1405.6662 1435.5475 1441.0926 1444.5047 1448.1906 1453.4710 1469.2129 1477.2720 1482.2244 1483.8858 1504.5522 1587.1670 1592.3776 1597.8952 1602.8709 1609.4265 1612.8291 1630.4132 2996.9399 3022.0173 3024.9557 3096.7248 3102.2768 3111.6201 3113.3357 3116.4088 3120.1718 3121.2309 3128.6843 3132.6477 3138.3881 3143.4930 3150.6753 3154.3925 3157.7926 3164.1298 3167.6365 3168.5935 3199.4411 3534.3650
redmass: 1.5051 6.6483 3.4412 5.8268 4.0011 3.2934 4.7322 4.9812 4.0305 4.4396 5.4503 4.5245 7.1978 5.3336 8.2428 4.8728 8.0292 6.6075 6.7906 7.0317 6.7409 5.8766 6.0444 8.5914 5.1220 2.8475 6.0968 2.3833 5.0640 5.6358 7.4650 2.8228 2.8404 2.9735 4.4551 4.1369 7.0175 3.4824 5.3171 6.0662 5.1374 5.9456 4.4060 3.1631 4.7367 6.3514 6.4167 6.9910 9.7422 1.1886 6.3073 1.7269 1.7330 3.3689 1.9896 1.9890 12.9462 3.9002 4.0520 4.6026 1.4676 1.2495 1.2494 1.4072 1.5782 1.6115 13.5133 6.2499 1.4312 1.4726 1.3875 1.4277 1.4712 5.3908 4.5536 2.8071 2.0754 1.3408 1.3217 1.3506 2.1930 2.2143 1.6375 2.4362 1.4948 1.5625 1.3045 1.1000 1.0715 1.0538 1.0530 1.1242 1.1132 1.1156 1.2578 3.3766 2.0060 2.7879 1.3859 1.8598 1.4093 1.2823 1.2654 4.2164 8.5388 8.5967 1.2348 4.6498 1.1868 2.1934 2.0024 1.0460 1.1425 1.1328 2.2192 2.3233 2.3083 2.2341 5.9470 6.0462 6.8448 5.8857 5.9991 5.9679 4.7682 1.0362 1.0600 1.0573 1.0994 1.0991 1.1086 1.0953 1.1018 1.0900 1.0877 1.0869 1.0872 1.0914 1.0918 1.0960 1.0966 1.0913 1.0950 1.1015 1.1016 1.0949 1.0766
irintensity: 0.1291 1.4325 0.4780 0.3585 4.7391 2.2305 0.9809 0.7725 0.6982 1.1092 6.1156 0.8379 1.7160 2.3180 2.2082 1.1152 13.4155 1.1422 2.6436 3.5303 8.9106 13.9195 0.4457 6.4176 13.7581 1.5953 8.5182 1.7514 18.5598 5.3773 7.6122 0.6196 0.1530 0.0361 14.5235 7.7444 69.2352 12.4569 7.0321 23.1416 79.8757 80.2652 53.3982 5.7672 30.2142 2.2688 31.9015 3.7718 210.0066 58.0548 14.8467 56.6051 54.9316 1.7934 32.8770 42.2283 75.8828 7.5659 5.0442 6.0083 34.2584 0.9022 0.4754 39.3776 4.6196 5.8766 96.4206 4.1640 3.3581 3.2957 2.2375 0.3445 0.2967 0.2074 0.6377 5.1264 15.3012 2.5607 0.1397 0.4502 6.4690 5.8059 15.3702 49.6583 10.0944 13.9647 11.0230 5.7466 2.4773 0.0604 0.0629 44.9421 1.1038 3.5182 5.6839 54.5937 7.4392 5.3748 37.3466 69.4056 51.3480 0.8037 1.1114 277.1125 0.3390 0.5300 45.4950 13.1140 4.8048 11.5307 12.5994 15.6850 14.6155 16.6579 47.0446 20.3059 9.9183 489.7904 2.0082 0.7724 112.3694 21.4918 5.9114 0.3687 114.4468 12.5412 11.2076 4.2502 13.7849 11.2410 2.0199 2.9667 20.9216 19.9892 4.8781 1.4986 1.3207 8.3993 11.4142 26.6851 20.9393 2.8289 6.1784 28.6457 25.0299 7.7873 12.8758
temp: 298.150 k
press: 1.00000 atm
elementType: 16 16 8 8 8 7 7 6 6 6 6 6 6 6 6 6 6 6 6 6 6 6 6 6 6 6 6 6 6 1 1 1 1 1 1 1 1 1 1 1 1 1 1 1 1 1 1 1 1 1 1
symmnumber: 1
zpe: 1020284.8 jmol-1
zpe.correction: 0.388606 hartree
zpe.thermalcorrener: 0.417784 hartree
zpe.thermalcorrenthalpy: 0.418728 hartree
zpe.thermalcorrgfe: 0.320099 hartree
zpe.sumelectzpe: -1980.535070 hartree
zpe.sumelectthermal: -1980.505892 hartree
zpe.sumelectthermalent: -1980.504948 hartree
zpe.sumelectthermalfe: -1980.603577 hartree
dipole: -2.7666 -1.9662 -8.0004
dipole: 8.6906
quadrupole: -132.6281 -174.7703 -193.8294
quadrupole: -21.3775 -14.6447 8.6626
quadrupole: 34.4479 -7.6944 -26.7535 -21.3775 -14.6447 8.6626
hfenergy: -1980.9236757 hartree
pointgroup: C01 [X(C22H22N2O3S2)]
dipole: 1.1640994 -0.6152344 3.1554521 debye
polarizability: 509.6663819|-22.7125284|311.1941901|0.1070263|-22.1789063|221.5634299 unknown
InChI: InChI=1S/C22H22N2O3S2/c1-18(25)23-21-12-14-22(15-13-21)29(26,27)24-28(16-19-8-4-2-5-9-19)17-20-10-6-3-7-11-20/h2-15,23H,16-17H2,1H3
charge 0 multiplicity 1
51 atoms
S  1.912919 0.131456 -0.389094
S  -0.705219 -0.587835 -1.559208
O  -0.026719 -2.087305 -1.718569
O  -0.878257 0.325508 -2.901711
O  -7.451531 0.569142 0.153283
N  0.106805 0.27451 -0.119556
N  -6.229325 -1.290544 0.907221
C  2.316916 1.344528 1.064121
C  2.338825 -1.608974 0.487429
C  2.422286 2.762178 0.577793
C  3.807114 -1.88302 0.465311
C  -2.407026 -0.776161 -0.786204
C  1.253666 3.486122 0.220037
C  4.427932 -2.365045 -0.720863
C  3.690302 3.391675 0.479996
C  4.612538 -1.6502 1.614111
C  -3.386529 0.184569 -1.080116
C  -2.656693 -1.892206 0.029234
C  -4.956275 -1.072407 0.311663
C  -4.676184 0.041907 -0.526803
C  -3.943796 -2.038113 0.576978
C  1.356926 4.822718 -0.219665
C  5.817308 -2.606223 -0.754888
C  3.790073 4.73153 0.044614
C  6.002747 -1.896057 1.58066
C  2.622943 5.449547 -0.304891
C  6.609515 -2.37187 0.394734
C  -7.385941 -0.50635 0.815445
C  -8.58704 -1.055619 1.582338
H  3.257841 0.959549 1.489757
H  1.466404 1.165372 1.743026
H  1.716322 -2.265089 -0.144837
H  1.897298 -1.497251 1.49055
H  0.280757 2.984442 0.268872
H  3.814077 -2.552023 -1.610004
H  4.596982 2.834173 0.746355
H  4.142982 -1.30051 2.542744
H  -3.148328 1.017636 -1.749371
H  -1.871857 -2.634439 0.204095
H  -5.462532 0.769832 -0.731127
H  -4.165925 -2.904776 1.212454
H  0.45298 5.374081 -0.500048
H  6.282964 -2.980145 -1.673246
H  4.771971 5.212464 -0.023531
H  6.610023 -1.72372 2.476177
H  2.699411 6.488119 -0.645472
H  7.687788 -2.563584 0.367592
H  -6.305076 -2.136373 1.476378
H  -8.372781 -1.969945 2.162575
H  -8.957696 -0.276128 2.269371
H  -9.399485 -1.272344 0.867089
