program: Gaussian 09
title: 000265198
version: EM64L-G09RevD.01
frameworkgroup: C1[X(C18H30N2O2)]
method: RPBEPBE
basis: SDD
operation: Freq
keyword: #p
keyword: freq=noraman
keyword: PBEPBE/SDD
title: #p freq=noraman PBEPBE/SDD
converged: NO YES NO NO
title: Mulliken charges:
elementType: O O N N C C C C C C C C C C C C C C C C C C H H H H H H H H H H H H H H H H H H H H H H H H H H H H H H
charge: -0.301250 -0.301619 -0.125925 -0.126828 -0.203046 -0.204572 -0.461085 -0.462066 -0.384107 -0.384681 0.181311 0.182776 -0.395763 -0.403616 -0.395444 -0.401801 -0.378662 -0.377543 -0.378678 -0.378323 -0.405563 -0.405579 0.232188 0.231979 0.264360 0.204576 0.264245 0.205770 0.206528 0.192643 0.206703 0.192644 0.202807 0.266891 0.245930 0.206687 0.202829 0.267099 0.245209 0.206307 0.212152 0.201383 0.202086 0.205189 0.211870 0.201378 0.202065 0.205091 0.190967 0.221730 0.190881 0.221878
chargesum: 0.00000
title: Mulliken charges with hydrogens summed into heavy atoms:
elementType: O O N N C C C C C C C C C C C C C C C C C C
charge: -0.301250 -0.301619 -0.125925 -0.126828 0.029142 0.027407 0.007851 0.007950 0.015065 0.014665 0.181311 0.182776 0.073935 0.049002 0.074484 0.049714 0.034872 0.029732 0.034570 0.028833 0.007134 0.007180
polarizability: 2.47201820e+02 5.88447168e-02 1.89326981e+02 9.31988664e+00 -8.31018228e-03 1.86707434e+02
1716.lowfreq: -9.3288 -6.8050 0.0004 0.0005 0.0006 6.7905 19.0873 41.2804 47.5128
frequency: 19.0464 41.1613 47.5123 58.9274 68.1547 68.6706 98.4407 112.6530 121.8628 146.1293 178.4799 189.6369 203.1671 247.6266 261.8394 264.1498 270.5260 339.0921 358.2498 364.2413 376.4985 391.8589 396.2566 418.2546 424.2492 432.7086 437.1457 459.3352 492.5456 525.1249 527.8208 567.5109 623.4294 650.2934 671.2295 693.7326 757.2239 771.0357 791.9952 802.5421 803.9926 826.9286 828.4588 845.9473 847.0510 859.3683 868.2281 871.2026 894.3661 906.8063 918.3094 943.1476 947.6513 949.0615 949.9288 993.1350 1008.2047 1023.8880 1043.4580 1044.8251 1062.2929 1068.8326 1087.8255 1088.4953 1095.9224 1104.7552 1121.0474 1122.4411 1127.2773 1130.1275 1147.9527 1152.5905 1153.2440 1169.6189 1202.5722 1220.4612 1234.8726 1234.9981 1247.9905 1253.1199 1256.0088 1259.0821 1259.9765 1273.4632 1277.1708 1283.4069 1320.9054 1324.9932 1329.1172 1333.0089 1336.4993 1336.7756 1337.6407 1342.6936 1343.4209 1346.5596 1347.5236 1348.7201 1356.0671 1357.0166 1359.8836 1367.7317 1414.2791 1417.7951 1455.5506 1456.1010 1461.5919 1462.4248 1462.8918 1464.7558 1465.0410 1465.7992 1468.2682 1468.8016 1474.2755 1476.8599 1477.2769 1479.7203 1551.9365 1561.3371 2944.3171 2945.4372 2951.2694 2953.1729 2966.7546 2967.0385 2970.5261 2973.8615 2983.2648 2983.4103 2986.6360 2987.1752 2990.5937 2991.4418 3002.1045 3006.4712 3027.2309 3033.4869 3035.5587 3036.1423 3044.9531 3045.0380 3053.8530 3054.1304 3058.5836 3061.5956 3087.3579 3087.7989 3107.1168 3108.0885
redmass: 4.0463 4.0049 3.2405 3.6471 4.3449 4.9837 4.0573 3.6101 3.6799 3.9020 2.9274 2.4387 3.1188 2.3592 2.5362 2.2386 2.3888 2.7786 2.3816 2.7742 2.8178 1.8090 2.1059 3.5980 3.0825 3.6941 2.8593 3.0949 2.2288 2.1451 2.0730 3.4398 2.9510 3.2400 4.3138 6.2827 3.0495 2.2827 3.5184 1.5079 1.5571 2.7097 2.8958 1.4483 1.4318 2.6126 2.5161 2.1887 2.4359 2.5131 1.8258 2.2130 1.5743 1.4149 1.9441 2.6389 2.5112 2.3050 2.0245 1.9513 1.7656 2.0749 1.4174 1.4010 1.6018 2.1556 2.3713 2.3220 1.6576 1.7878 1.2893 1.3228 1.3405 1.6441 1.4949 1.6617 2.4429 2.0983 1.5946 1.3388 1.2663 1.3899 1.3548 1.2828 1.1960 1.2450 1.3146 1.3361 1.2807 1.4592 1.3494 1.3482 1.3454 1.5010 1.4813 1.4517 1.4522 1.4299 1.3700 1.3630 1.3898 1.4565 2.6030 2.7122 1.0910 1.0908 1.0933 1.0884 1.0875 1.0843 1.1037 1.0981 1.0898 1.0893 1.1031 1.1066 1.1004 1.0909 7.0612 6.5183 1.0716 1.0717 1.0698 1.0696 1.0640 1.0639 1.0584 1.0632 1.0610 1.0610 1.0612 1.0612 1.0643 1.0643 1.0794 1.0826 1.0968 1.1034 1.0960 1.0960 1.1026 1.1026 1.1032 1.1031 1.1007 1.1003 1.0929 1.0931 1.0898 1.0897
irintensity: 0.9091 0.5889 1.2305 2.5563 1.0197 2.3345 1.2832 2.9776 0.0342 1.5222 0.0700 7.4586 0.2230 0.0633 0.7719 3.5141 1.2830 13.7701 4.4008 1.9768 7.5674 1.8964 0.8551 4.0605 0.9847 0.8736 1.0063 2.4827 0.1794 2.9765 15.1894 16.4195 0.0015 2.5789 2.9877 5.2420 1.2665 0.4537 0.0338 0.1472 0.1452 2.4731 2.1633 18.3759 19.6066 0.7501 3.0321 8.5835 10.3463 1.7920 16.2313 11.4517 0.1828 15.5070 0.2689 102.2906 0.8012 6.8162 0.4122 11.5652 7.2777 0.5869 0.6508 0.9090 0.6789 5.7081 17.7480 3.4661 87.0947 24.8921 13.3171 1.9551 1.0846 0.7637 158.9605 58.7159 17.8674 9.9162 5.4859 28.0538 0.2768 73.0128 21.0182 40.7727 0.3315 10.9856 1.6954 0.0151 0.0071 0.0269 1.3553 0.4683 2.2279 9.9242 6.7677 4.2749 2.4733 0.0384 7.5309 4.3621 8.0463 2.1561 213.3316 32.4247 8.0902 9.8177 4.4547 20.5173 9.0744 6.1815 25.0479 26.9716 8.5755 11.1006 22.9074 14.2149 3.5628 3.3310 427.4579 23.8388 26.0407 26.3613 64.9463 57.5316 55.7702 35.5241 20.9205 42.0019 31.3587 24.3977 33.9245 32.7231 12.4194 56.9321 74.7419 35.1514 53.3153 41.9277 55.1118 64.5245 31.8639 38.0643 116.3920 58.5668 7.1828 49.6221 7.8050 7.2982 15.0183 14.4556
temp: 298.150 k
press: 1.00000 atm
elementType: 8 8 7 7 6 6 6 6 6 6 6 6 6 6 6 6 6 6 6 6 6 6 1 1 1 1 1 1 1 1 1 1 1 1 1 1 1 1 1 1 1 1 1 1 1 1 1 1 1 1 1 1
symmnumber: 1
zpe: 1208811.7 jmol-1
zpe.correction: 0.460412 hartree
zpe.thermalcorrener: 0.481544 hartree
zpe.thermalcorrenthalpy: 0.482489 hartree
zpe.thermalcorrgfe: 0.409580 hartree
zpe.sumelectzpe: -962.163485 hartree
zpe.sumelectthermal: -962.142352 hartree
zpe.sumelectthermalent: -962.141408 hartree
zpe.sumelectthermalfe: -962.214316 hartree
dipole: 0.0209 -2.1151 -0.0066
dipole: 2.1152
quadrupole: -108.5094 -131.3221 -143.9208
quadrupole: 0.0824 10.9827 -0.1131
quadrupole: 19.4081 -3.4047 -16.0034 0.0824 10.9827 -0.1131
hfenergy: -962.6238966 hartree
pointgroup: C01 [X(C18H30N2O2)]
dipole: -0.1758409 0.8129593 -0.0261871 debye
polarizability: 242.2361335|10.4724636|191.3969891|-15.5971803|-3.1982832|189.603113 unknown
InChI: InChI=1S/C18H30N2O2/c21-17(19-11-5-1-6-12-19)15-9-3-4-10-16(15)18(22)20-13-7-2-8-14-20/h15-16H,1-14H2
charge 0 multiplicity 1
52 atoms
O  1.817471 0.11281 1.805539
O  -1.790572 -0.712573 -1.615065
N  2.885093 0.854891 -0.116135
N  -3.090077 -0.34747 0.272042
C  0.679387 -0.339724 -0.336124
C  -0.594512 -0.567736 0.536986
C  1.126694 -1.631466 -1.09638
C  -0.522234 -1.886582 1.37525
C  1.219137 -2.871263 -0.181391
C  -0.129515 -3.117415 0.529738
C  1.822223 0.22582 0.532118
C  -1.856472 -0.541483 -0.349772
C  4.037452 1.337691 0.682903
C  2.990441 1.144823 -1.562838
C  -4.327781 -0.425775 -0.541392
C  -3.321867 -0.037295 1.700226
C  4.249973 2.855611 0.488682
C  3.187976 2.661267 -1.811638
C  -5.151804 0.876222 -0.432455
C  -4.134969 1.272217 1.859933
C  4.395568 3.204045 -1.011725
C  -5.448841 1.215353 1.047115
H  0.405398 0.406296 -1.106409
H  -0.637612 0.269869 1.259034
H  0.373558 -1.814306 -1.884239
H  2.100622 -1.459369 -1.593346
H  0.238015 -1.726627 2.161504
H  -1.492119 -2.069299 1.876488
H  2.013437 -2.729529 0.57932
H  1.502537 -3.753454 -0.787907
H  -0.910789 -3.329623 -0.228119
H  -0.062705 -4.00677 1.186237
H  4.947768 0.789984 0.357232
H  3.832616 1.085427 1.735359
H  2.095856 0.786081 -2.091009
H  3.862747 0.592451 -1.975185
H  -4.936425 -1.281548 -0.177609
H  -4.021213 -0.62876 -1.579682
H  -2.364053 0.041785 2.233545
H  -3.890216 -0.874679 2.1609
H  3.384453 3.397002 0.917839
H  5.149396 3.171815 1.051087
H  3.327553 2.833433 -2.89633
H  2.268234 3.197996 -1.506043
H  -4.582645 1.70313 -0.900092
H  -6.093331 0.759115 -1.002519
H  -4.345983 1.434503 2.93461
H  -3.517889 2.123665 1.511138
H  5.329222 2.749437 -1.404529
H  4.489023 4.297602 -1.150048
H  -6.111071 0.434096 1.475747
H  -5.992355 2.175509 1.12621
