program: Gaussian 09
title: 000265196
version: EM64L-G09RevD.01
frameworkgroup: C1[X(C18H21NO)]
method: RPBEPBE
basis: SDD
operation: Freq
keyword: #p
keyword: freq=noraman
keyword: PBEPBE/SDD
title: #p freq=noraman PBEPBE/SDD
converged: YES YES NO NO
title: Mulliken charges:
elementType: O N C C C C C C C C C C C C C C C C C C H H H H H H H H H H H H H H H H H H H H H
charge: -0.214675 -0.055405 -0.514758 -0.388012 0.079270 0.051281 -0.501600 0.348268 0.331936 0.486525 -0.618107 -0.599253 0.195932 -0.831761 -0.852508 -0.816274 -0.346341 -0.174533 -0.353474 -0.185903 0.309576 0.239900 0.223665 0.231199 0.217046 0.211224 0.237991 0.235486 0.222558 0.266689 0.221084 0.228150 0.236010 0.248118 0.236026 0.223765 0.224640 0.240251 0.238457 0.235030 0.232526
chargesum: 0.00000
title: Mulliken charges with hydrogens summed into heavy atoms:
elementType: O N C C C C C C C C C C C C C C C C C C
charge: -0.214675 -0.055405 0.034718 0.066852 0.079270 0.051281 -0.073330 0.348268 0.331936 0.486525 -0.380116 -0.363767 0.195932 -0.121429 -0.140230 -0.131843 -0.106090 0.063924 -0.118444 0.046623
polarizability: 2.55821499e+02 -3.63437233e+00 2.21291119e+02 -2.70240883e+01 -1.47788369e+00 1.25078548e+02
1716.lowfreq: -13.9047 -8.0816 -3.7833 -0.0004 0.0001 0.0004 6.6015 17.2973 21.8681
frequency: 1.9810 17.1808 21.7436 26.2086 38.8753 51.7965 100.4645 123.2358 127.2690 134.5919 169.2458 185.6741 189.5744 217.1223 226.3070 251.0482 272.7396 274.7525 313.2164 333.7023 390.5837 404.5506 420.8325 468.7066 498.0023 512.3031 519.5293 549.0107 567.0641 572.1083 582.6061 598.0990 620.6033 737.2316 749.7009 758.3528 759.9667 785.2417 820.3712 857.1098 867.3049 896.4907 897.5076 928.6944 950.0759 954.9477 956.2703 981.8387 993.4986 999.7107 1016.6033 1020.3577 1027.8085 1041.0535 1041.5110 1043.2967 1046.4824 1051.1717 1064.1458 1096.9692 1132.8310 1157.4391 1165.0801 1185.7598 1218.6586 1235.2968 1253.5661 1275.3609 1288.7653 1296.9042 1311.1972 1316.0948 1328.6803 1356.5756 1356.9747 1396.6975 1398.7361 1402.5586 1412.8784 1414.2610 1434.7051 1441.4419 1454.9633 1463.9655 1464.3617 1469.6012 1473.1830 1473.4872 1479.0714 1484.7183 1491.8946 1563.2998 1573.0699 1582.1799 1593.3372 1617.2212 2965.5859 2973.7538 2976.2691 2982.8892 2992.1795 2999.2355 3021.6548 3053.0070 3054.8072 3058.0945 3061.3463 3065.3953 3083.5233 3083.7978 3090.3350 3110.9782 3116.9928 3122.2167 3135.0822 3151.9651 3169.9261
redmass: 4.0808 4.2971 4.2523 1.0513 5.0256 4.1129 3.3390 2.9746 1.1412 2.8267 2.5626 1.7174 1.6517 3.0542 3.4273 3.7835 2.9299 3.0136 3.0300 3.5548 2.4528 3.5560 3.6210 2.9604 3.7511 4.2653 3.0618 4.3847 3.4398 3.2844 2.3706 3.5126 6.6805 2.4138 1.8617 3.3409 2.5696 2.6717 2.5624 1.9477 1.3838 1.3122 1.3219 2.6662 3.0873 1.4857 3.9046 3.3024 2.8674 1.3424 1.6423 1.6719 2.0279 1.7549 2.1238 1.6060 1.6889 1.7102 2.2219 1.7424 1.3474 1.9020 1.0834 1.3364 1.7873 2.2549 1.4278 1.1866 1.6172 2.1812 5.7265 2.0015 1.8090 1.5687 7.2299 1.2312 1.3113 1.2466 2.2701 1.9293 1.2468 1.7803 2.0469 1.0554 1.1301 1.1253 1.0991 1.0570 1.1321 1.0880 1.3198 5.7498 6.9685 5.7697 7.8038 5.8757 1.0662 1.0386 1.0390 1.0378 1.0601 1.0627 1.0889 1.1014 1.0949 1.0952 1.1023 1.0957 1.0998 1.0996 1.1001 1.0910 1.0917 1.0886 1.0885 1.0946 1.1015
irintensity: 0.5218 1.0017 2.8573 0.6214 1.1449 1.8426 4.0141 0.5666 0.7504 4.3149 3.1477 1.6739 1.4165 0.6149 0.1423 8.8088 1.7587 0.4341 0.9411 0.5538 2.0842 8.3785 2.1615 0.5998 8.9894 1.1165 1.9903 1.4604 3.2188 6.7135 1.5751 5.9632 0.8459 10.0555 30.6951 9.8775 14.1045 29.0140 9.4288 21.9219 16.0563 0.1289 0.0974 0.2673 2.3546 0.5393 5.9988 6.3538 23.7818 0.1242 1.9197 4.5715 3.1753 4.3729 3.6528 0.4113 6.8396 25.8570 3.1487 7.5385 3.0235 6.0347 4.1839 19.0868 31.6208 2.4264 1.4614 13.6860 46.6718 12.7773 3.7658 1.6789 47.3709 50.6950 0.2909 14.9944 20.3755 11.4549 4.0277 13.2416 26.3334 29.6340 27.2862 18.2793 12.2949 21.2504 10.2533 11.7480 27.7596 12.6533 15.8344 11.3153 28.4385 43.5104 102.2613 47.7266 28.3477 41.9124 24.5076 23.7158 27.2256 28.7322 14.9285 30.4627 21.6017 18.4004 29.0099 19.9903 11.5115 24.1276 17.6752 26.2388 20.2038 14.7116 3.7878 25.8208 22.1790
temp: 298.150 k
press: 1.00000 atm
elementType: 8 7 6 6 6 6 6 6 6 6 6 6 6 6 6 6 6 6 6 6 1 1 1 1 1 1 1 1 1 1 1 1 1 1 1 1 1 1 1 1 1
symmnumber: 1
zpe: 893361.0 jmol-1
zpe.correction: 0.340263 hartree
zpe.thermalcorrener: 0.360723 hartree
zpe.thermalcorrenthalpy: 0.361667 hartree
zpe.thermalcorrgfe: 0.285080 hartree
zpe.sumelectzpe: -827.035248 hartree
zpe.sumelectthermal: -827.014788 hartree
zpe.sumelectthermalent: -827.013844 hartree
zpe.sumelectthermalfe: -827.090431 hartree
dipole: -1.9339 -1.7597 -1.0829
dipole: 2.8301
quadrupole: -94.3301 -111.0997 -127.0462
quadrupole: -1.6517 -8.7262 -7.9085
quadrupole: 16.4952 -0.2744 -16.2209 -1.6517 -8.7262 -7.9085
hfenergy: -827.375511 hartree
pointgroup: C01 [X(C18H21N1O1)]
dipole: -0.7820284 -0.7636406 -0.2122053 debye
polarizability: 250.589257|-10.7316453|216.7890348|-35.9788392|-19.546963|134.8128739 unknown
InChI: InChI=1S/C18H21NO/c1-13-11-14(2)18(15(3)12-13)17(20)9-6-8-16-7-4-5-10-19-16/h4-5,7,10-12H,6,8-9H2,1-3H3
charge 0 multiplicity 1
41 atoms
O  0.753991 2.273268 1.036619
N  -3.076356 -0.986677 -0.329794
C  -0.50858 0.916429 -0.548269
C  -1.677622 1.904993 -0.37686
C  1.954748 0.387396 0.103056
C  0.726452 1.25884 0.280413
C  -2.998153 1.384804 -1.020632
C  3.144136 0.991848 -0.412657
C  1.947026 -0.996181 0.451786
C  4.306714 -1.188247 -0.275687
C  4.290987 0.187978 -0.608349
C  3.127364 -1.755392 0.260319
C  -3.646678 0.260716 -0.232093
C  3.198704 2.470656 -0.764759
C  0.731105 -1.683897 1.059622
C  5.563709 -2.02174 -0.45432
C  -4.782649 0.492428 0.588706
C  -5.348998 -0.576845 1.316535
C  -3.632109 -2.010528 0.381772
C  -4.764949 -1.860066 1.212399
H  -0.850727 -0.109932 -0.316211
H  -0.189168 0.862326 -1.611181
H  -1.411926 2.87739 -0.832797
H  -1.833557 2.108094 0.699009
H  -2.783769 1.025123 -2.045114
H  -3.712693 2.224438 -1.104427
H  5.195719 0.650056 -1.023522
H  3.123548 -2.816214 0.542886
H  4.154518 2.719892 -1.256153
H  3.094051 3.095024 0.139664
H  2.378543 2.765645 -1.446231
H  1.040941 -2.581309 1.622677
H  0.182085 -1.025239 1.755319
H  0.013402 -2.014366 0.284308
H  6.198635 -1.982313 0.45245
H  5.323045 -3.083441 -0.639902
H  6.175656 -1.656244 -1.297859
H  -5.212127 1.498087 0.647324
H  -6.227838 -0.413568 1.949694
H  -3.145213 -2.986944 0.270675
H  -5.17217 -2.71909 1.754685
