program: Gaussian 09
title: 000265189
version: EM64L-G09RevD.01
frameworkgroup: C1[X(C17H18O2S)]
method: RPBEPBE
basis: SDD
operation: Freq
keyword: #p
keyword: freq=noraman
keyword: PBEPBE/SDD
title: #p freq=noraman PBEPBE/SDD
converged: YES YES NO NO
title: Mulliken charges:
elementType: S O O C C C C C C C C C C C C C C C C C H H H H H H H H H H H H H H H H H H
charge: 0.088503 -0.252236 -0.217860 0.102750 0.112193 0.389093 0.348643 0.389301 0.348058 -0.417040 -0.409537 -0.416920 -0.409072 -0.222500 -0.226243 -0.808878 -0.824048 -0.808989 -0.823537 -0.236600 0.237064 0.236757 0.237104 0.236799 0.228245 0.227935 0.248883 0.227541 0.234592 0.254617 0.254793 0.225178 0.234972 0.248755 0.227533 0.254885 0.254168 0.225099
chargesum: 0.00000
title: Mulliken charges with hydrogens summed into heavy atoms:
elementType: S O O C C C C C C C C C C C C C C C C C
charge: 0.088503 -0.252236 -0.217860 0.102750 0.112193 0.389093 0.348643 0.389301 0.348058 -0.179976 -0.172779 -0.179816 -0.172273 0.005745 0.001691 -0.097862 -0.089460 -0.097729 -0.089385 -0.236600
polarizability: 2.39194966e+02 -2.51551563e-01 2.08408967e+02 -1.95977673e+01 -5.79103637e-02 1.62574418e+02
1716.lowfreq: -8.7468 -4.9409 -0.0020 -0.0015 0.0007 7.0688 11.9990 44.3841 47.2691
frequency: 8.4472 44.3704 47.2108 51.3597 75.3593 82.1695 88.5832 95.3989 127.3279 139.2055 174.5968 181.2254 224.9570 225.9325 227.6567 238.3666 277.8587 284.4098 289.9987 297.1526 331.9329 407.7675 465.2303 472.7345 490.0123 512.4034 514.8156 517.7512 531.4069 536.9705 546.2477 572.1141 583.8169 633.5111 672.7677 722.7168 733.2743 748.9263 779.4086 781.1173 800.5819 866.1565 896.4099 896.9377 918.6829 920.9850 975.7008 978.4066 985.4970 987.4803 1041.9868 1042.9058 1046.1109 1047.4699 1051.0516 1052.2902 1075.4596 1078.9468 1088.1676 1121.8773 1140.5214 1177.7238 1178.5115 1202.8283 1260.1167 1261.3251 1277.8088 1280.1332 1374.2288 1374.9278 1396.8581 1397.9681 1401.9187 1402.8397 1426.4504 1429.1751 1455.7639 1456.4312 1462.8125 1464.5879 1469.0099 1469.6524 1483.3088 1483.7880 1487.6838 1489.6350 1594.9091 1596.3192 1617.5743 1619.3916 2978.9016 2979.5199 2989.8666 2990.2826 3059.7751 3059.9208 3069.8566 3070.0575 3092.9402 3093.3519 3096.3722 3096.7404 3126.1171 3127.1612 3136.5643 3137.2163 3159.9487 3161.0750
redmass: 3.7890 5.0496 4.5631 8.3846 4.0577 4.7675 1.0298 1.0465 3.0275 3.5416 1.0807 1.0990 4.3455 2.9345 2.7322 3.6056 3.8495 4.5943 3.1962 4.6122 4.2519 5.8465 3.3728 3.4626 4.8278 3.0842 3.1063 4.9682 5.8963 5.7201 4.6664 11.6417 4.5462 5.6776 5.8211 5.2285 4.6508 5.5356 1.2328 1.2166 5.7221 6.9411 1.3132 1.3124 2.5078 2.5206 1.3386 1.3397 1.6054 1.6260 1.7751 1.8162 1.5539 1.5464 1.5272 1.5044 2.7418 6.9617 2.2315 2.4850 3.7170 1.1661 1.1663 11.7769 1.5614 1.5541 3.1872 3.1437 6.8007 6.5133 1.2543 1.2453 1.2592 1.2231 2.4913 2.4680 1.8902 1.6397 1.0636 1.1995 1.0497 1.0545 1.2459 1.2985 1.2168 1.2119 5.5046 5.5412 8.2067 8.2972 1.0373 1.0373 1.0365 1.0365 1.0975 1.0976 1.0965 1.0965 1.0989 1.0988 1.1000 1.0999 1.0858 1.0859 1.0922 1.0922 1.0995 1.0995
irintensity: 0.0003 0.3169 0.1571 0.3293 0.0014 0.2770 0.2306 0.6821 3.3166 0.9349 0.1032 0.4403 5.6814 0.0765 0.0302 6.2254 5.1775 5.5279 0.6575 0.0011 1.8285 2.7153 0.7140 0.1880 1.4444 0.0362 0.0784 4.3844 0.7897 0.1517 2.1853 1.7156 4.2686 0.3462 0.7076 3.0296 2.1257 1.1687 59.2682 54.9255 8.1643 0.2867 0.0027 0.0760 0.7418 6.4314 0.0455 0.0049 12.1742 3.7617 0.7851 0.4800 14.2382 0.9173 13.5292 0.0470 64.8817 654.7775 50.9638 38.5383 16.5532 1.0795 2.3880 648.4382 0.1514 0.3697 9.7058 6.0659 4.0140 5.3049 1.7831 5.6676 27.7638 4.1678 8.7171 6.8595 0.5867 0.0142 4.8442 1.4302 21.0213 16.6390 85.9275 3.9355 43.2608 21.3596 0.9661 0.1443 1.9558 2.7554 34.1955 14.2490 34.1992 2.9345 0.1374 21.8521 7.1731 15.9480 19.7400 34.6609 17.7282 19.6518 0.1563 0.0345 19.3586 22.1367 32.5393 27.7836
temp: 298.150 k
press: 1.00000 atm
elementType: 16 8 8 6 6 6 6 6 6 6 6 6 6 6 6 6 6 6 6 6 1 1 1 1 1 1 1 1 1 1 1 1 1 1 1 1 1 1
symmnumber: 1
zpe: 790549.1 jmol-1
zpe.correction: 0.301104 hartree
zpe.thermalcorrener: 0.321552 hartree
zpe.thermalcorrenthalpy: 0.322496 hartree
zpe.thermalcorrgfe: 0.250005 hartree
zpe.sumelectzpe: -1205.667662 hartree
zpe.sumelectthermal: -1205.647214 hartree
zpe.sumelectthermalent: -1205.646270 hartree
zpe.sumelectthermalfe: -1205.718761 hartree
dipole: 0.3608 -0.0024 -3.4361
dipole: 3.4550
quadrupole: -114.1916 -108.9935 -136.5233
quadrupole: -0.0718 0.3667 -0.0014
quadrupole: 5.7112 10.9093 -16.6205 -0.0718 0.3667 -0.0014
hfenergy: -1205.9687661 hartree
pointgroup: C01 [X(C17H18O2S1)]
dipole: 0.0670432 -0.00165 -1.3576299 debye
polarizability: 236.7973658|-0.3614477|208.4110967|-23.703848|0.0226651|164.9698892 unknown
InChI: InChI=1S/C17H18O2S/c1-11-7-5-8-12(2)15(11)18-17(20)19-16-13(3)9-6-10-14(16)4/h5-10H,1-4H3
charge 0 multiplicity 1
38 atoms
S  -0.970306 0.003395 2.865147
O  -0.469543 0.007675 0.155229
O  1.35214 -0.001091 1.531912
C  -1.891978 0.005895 -0.122429
C  2.190277 -0.003801 0.345305
C  -2.534612 1.253717 -0.294797
C  2.630687 1.244697 -0.150867
C  -2.528514 -1.243976 -0.302459
C  2.635367 -1.254982 -0.139792
C  -3.902031 1.225972 -0.664339
C  3.540482 1.216234 -1.237104
C  -3.896075 -1.220877 -0.671775
C  3.545123 -1.232711 -1.226275
C  -4.579201 0.001439 -0.851262
C  3.987786 -0.009824 -1.77698
C  -1.798989 2.560637 -0.084867
C  2.163489 2.545791 0.468556
C  -1.786245 -2.548271 -0.099814
C  2.173182 -2.552437 0.491173
C  -0.025496 0.003311 1.475195
H  -4.432725 2.174868 -0.801773
H  3.903409 2.16433 -1.650171
H  -4.421988 -2.171557 -0.81514
H  3.911685 -2.18306 -1.630875
H  -5.6369 -0.000248 -1.135927
H  4.693138 -0.012175 -2.615041
H  -1.422833 2.642696 0.952132
H  -2.464764 3.418775 -0.274404
H  -0.929469 2.643175 -0.762698
H  2.280208 2.528592 1.566844
H  1.092765 2.728732 0.264051
H  2.735279 3.399095 0.067538
H  -0.908421 -2.616685 -0.768336
H  -1.421303 -2.639745 0.940492
H  -2.443864 -3.40866 -0.30684
H  2.285142 -2.523036 1.589653
H  1.104402 -2.744353 0.284305
H  2.751793 -3.406339 0.101335
