program: Gaussian 09
title: 000265172
version: EM64L-G09RevD.01
frameworkgroup: C1[X(C15H14O3S)]
method: RPBEPBE
basis: SDD
operation: Freq
keyword: #p
keyword: freq=noraman
keyword: PBEPBE/SDD
title: #p freq=noraman PBEPBE/SDD
converged: YES YES NO NO
title: Mulliken charges:
elementType: S O O O C C C C C C C C C C C C C C C H H H H H H H H H H H H H H
charge: 0.853654 -0.523857 -0.551633 -0.207187 -0.609076 0.503606 -0.008140 0.277840 -0.414480 -0.304538 -0.238007 -0.273127 -0.783421 -0.215411 -0.245450 -0.203393 -0.203327 -0.229612 -0.215022 0.313998 0.234842 0.265413 0.278132 0.288748 0.254061 0.275923 0.256108 0.233317 0.233705 0.242157 0.241279 0.235192 0.237705
chargesum: 0.00000
title: Mulliken charges with hydrogens summed into heavy atoms:
elementType: S O O O C C C C C C C C C C C C C C C
charge: 0.853654 -0.523857 -0.551633 -0.207187 -0.295078 0.503606 -0.008140 0.277840 -0.179638 -0.039125 0.040125 0.015621 0.002671 0.017907 -0.011745 0.038765 0.037953 0.005579 0.022683
polarizability: 2.99600514e+02 1.32336716e+01 1.77208869e+02 -1.26961144e+01 1.88220759e+01 1.43757481e+02
1716.lowfreq: -6.1042 -0.0019 -0.0015 0.0018 0.8042 7.9451 13.1086 32.5173 38.8787
frequency: 11.3835 32.4118 38.8726 43.0714 57.3107 77.8144 117.8851 140.9493 159.2665 170.4893 187.7419 198.2349 237.4558 245.1659 270.3955 317.0058 338.2718 367.2452 393.3150 402.2106 407.3698 425.1204 490.5979 502.8253 537.5815 594.3304 601.8357 614.9499 631.4969 657.0601 687.2483 696.2182 754.8978 758.9614 788.8548 794.7113 847.1023 847.5681 875.8575 912.1850 926.1771 931.1881 976.4991 976.9113 981.5560 988.1105 993.5990 1001.7163 1004.7702 1007.3602 1025.0991 1030.9266 1046.7378 1077.6466 1086.4678 1123.1682 1173.9495 1174.9318 1178.2472 1189.3431 1197.2566 1245.1207 1294.1856 1303.7510 1343.0117 1372.6312 1383.8426 1386.1396 1436.6881 1441.6370 1446.8043 1451.6807 1458.0217 1482.7198 1576.1512 1583.9194 1586.0292 1603.0173 1608.1653 2973.2832 3068.8302 3085.0689 3125.2959 3126.9005 3135.0441 3138.0550 3147.4842 3148.7553 3158.0499 3159.2156 3167.4853 3171.0141 3176.7883
redmass: 5.8526 3.9303 4.8559 5.6683 6.2251 5.8874 5.1313 6.0153 5.2566 5.5582 7.9952 7.4170 1.1534 5.1944 3.4514 4.7360 7.5521 9.0905 4.2913 2.8065 3.5526 8.0064 3.6086 4.6748 3.3105 2.9966 6.4596 5.8599 5.7940 6.9460 2.3663 1.7109 2.2701 1.5205 6.8355 3.7141 1.2497 1.2514 3.7497 10.5052 1.4292 1.3577 1.7246 3.3246 1.4365 4.3212 1.8476 1.4372 1.3489 4.2396 1.8562 1.9765 2.0891 1.5458 1.6218 1.1925 1.0571 1.0996 1.1217 1.7672 1.1656 2.3689 2.2371 1.2990 1.3603 1.2615 8.4194 6.9677 2.2499 1.9839 1.1505 2.0278 1.0862 2.1847 5.8413 5.8022 6.3394 6.9276 5.9838 1.0407 1.0919 1.0866 1.1003 1.0867 1.0877 1.0858 1.0922 1.0887 1.0929 1.0961 1.0969 1.1013 1.1011
irintensity: 2.5423 0.2832 0.5657 1.8032 3.8545 3.2594 2.1142 3.0457 3.0884 2.0486 4.0426 3.2169 0.6155 9.4571 5.2745 4.7116 1.3496 15.9497 8.9434 0.0544 3.5692 54.8987 7.8742 96.8973 16.3932 19.3267 0.1451 3.2469 0.6456 3.5082 27.3646 48.2991 24.0954 55.1529 18.8443 58.2802 0.8894 0.9444 1.7510 51.7686 0.6853 0.6174 4.0115 4.2800 0.3830 3.9572 17.9731 3.0328 0.5914 1.4111 5.0261 2.1070 23.0182 6.9809 8.4616 5.5224 0.3905 3.7109 11.5193 39.8549 3.9974 103.1308 23.3227 3.4559 6.8179 82.0378 6.3067 0.4752 16.2067 20.9914 24.0499 15.3648 29.6999 2.7190 5.3656 7.2790 86.2575 0.5764 13.8869 2.9591 3.4242 3.1836 12.0179 3.0994 0.8902 1.0979 16.1492 9.0895 2.9846 20.8020 7.2342 23.6008 27.8291
temp: 298.150 k
press: 1.00000 atm
elementType: 16 8 8 8 6 6 6 6 6 6 6 6 6 6 6 6 6 6 6 1 1 1 1 1 1 1 1 1 1 1 1 1 1
symmnumber: 1
zpe: 652621.0 jmol-1
zpe.correction: 0.248570 hartree
zpe.thermalcorrener: 0.267029 hartree
zpe.thermalcorrenthalpy: 0.267973 hartree
zpe.thermalcorrgfe: 0.199170 hartree
zpe.sumelectzpe: -1202.203695 hartree
zpe.sumelectthermal: -1202.185236 hartree
zpe.sumelectthermalent: -1202.184292 hartree
zpe.sumelectthermalfe: -1202.253095 hartree
dipole: -0.0506 -0.1939 -2.6351
dipole: 2.6427
quadrupole: -86.5931 -117.3076 -128.6990
quadrupole: -2.9467 -1.8662 12.4911
quadrupole: 24.2735 -6.4410 -17.8324 -2.9467 -1.8662 12.4911
hfenergy: -1202.4522648 hartree
pointgroup: C01 [X(C15H14O3S1)]
dipole: -0.0742887 0.1806551 -1.0211997 debye
polarizability: 300.8154277|10.425065|180.6472237|-0.8546814|-16.104357|139.104213 unknown
InChI: InChI=1S/C15H14O3S/c1-12(16)15(13-8-4-2-5-9-13)19(17,18)14-10-6-3-7-11-14/h2-11,15H,1H3
charge 0 multiplicity 1
33 atoms
S  -0.436653 0.127652 0.875517
O  0.1054 1.611577 1.289455
O  -0.273727 -1.14538 1.900314
O  -0.896718 -2.031207 -1.872716
C  0.573056 -0.402454 -0.924134
C  1.991462 0.012056 -0.740727
C  -2.269404 0.293484 0.432814
C  0.136194 -1.842978 -1.164514
C  2.508594 1.01995 -1.601407
C  2.836478 -0.524391 0.272245
C  -3.08776 -0.842526 0.53536
C  -2.729482 1.568367 0.063706
C  0.895273 -2.985531 -0.52872
C  3.846754 1.449944 -1.486339
C  4.168487 -0.081998 0.394128
C  -4.459573 -0.68495 0.2303
C  -4.104865 1.702859 -0.236318
C  4.682516 0.897348 -0.489091
C  -4.962162 0.579438 -0.157852
H  0.012926 0.250317 -1.613261
H  1.858418 1.459489 -2.367244
H  2.440276 -1.250625 0.988844
H  -2.674792 -1.803643 0.855995
H  -2.045054 2.422899 0.045657
H  1.97147 -2.945548 -0.770979
H  0.794237 -2.904619 0.572353
H  0.469565 -3.942113 -0.867683
H  4.232605 2.219793 -2.163061
H  4.804031 -0.490491 1.187161
H  -5.129716 -1.548135 0.295407
H  -4.503579 2.681585 -0.522681
H  5.719512 1.236546 -0.390479
H  -6.026268 0.691583 -0.392243
