program: Gaussian 09
title: 000024867
version: EM64L-G09RevD.01
frameworkgroup: C1[X(C23H32N2)]
method: RPBEPBE
basis: SDD
operation: Freq
keyword: #p
keyword: freq=noraman
keyword: PBEPBE/SDD
title: #p freq=noraman PBEPBE/SDD
converged: YES YES NO NO
title: Mulliken charges:
elementType: N N C C C C C C C C C C C C C C C C C C C C C C C H H H H H H H H H H H H H H H H H H H H H H H H H H H H H H H H
charge: -0.153675 -0.128953 -0.028006 -0.659427 -0.512223 -0.574913 0.420605 0.421618 -0.370661 0.377707 0.401075 -0.565402 -0.560411 -0.363858 -0.493014 -0.494566 -0.444657 -0.452004 -0.223973 -0.223696 -0.219276 -0.214457 -0.549248 -0.535190 -0.556133 0.281594 0.212603 0.234589 0.281952 0.298621 0.273893 0.298506 0.254386 0.264109 0.302305 0.308596 0.280804 0.250153 0.304151 0.286468 0.250217 0.236203 0.271017 0.268174 0.258064 0.254994 0.262903 0.262026 0.291308 0.262656 0.277306 0.285964 0.275706 0.275899 0.289547 0.275375 0.272650
chargesum: 2.00000
title: Mulliken charges with hydrogens summed into heavy atoms:
elementType: N N C C C C C C C C C C C C C C C C C C C C C C C
charge: -0.153675 -0.128953 0.253588 -0.446824 0.004318 -0.276292 0.420605 0.421618 0.201738 0.377707 0.401075 0.255399 0.279143 0.226760 -0.242797 -0.258363 -0.173640 -0.183830 0.034091 0.031298 0.043627 0.047569 0.282022 0.302379 0.281438
polarizability: 2.64233517e+02 -4.79216961e+00 2.62744424e+02 1.38829477e+01 7.31127405e+00 2.06869807e+02
1716.lowfreq: -19.3335 -10.1505 -6.8826 -0.0008 -0.0006 -0.0006 22.6141 27.2282 28.5967
frequency: 18.2142 26.7448 28.1814 64.4516 75.6853 90.7017 133.7756 138.9186 142.1590 151.7732 165.7533 185.3189 196.2610 200.5125 241.4309 256.8636 271.4834 274.1108 281.3013 304.3541 307.1218 336.0352 341.8922 349.8451 367.7949 379.8119 393.8167 427.4993 430.2922 442.1807 454.4786 465.5143 487.4579 493.3603 501.1723 541.5592 561.6140 577.1420 594.5120 622.4236 643.1614 670.2321 721.7372 727.9857 749.5622 760.7760 763.2594 774.8856 785.4606 793.3987 813.4094 822.8439 835.2068 867.1576 877.9738 883.4568 892.5465 898.7374 905.3991 910.9027 929.8740 951.8402 957.5187 960.9467 967.9193 992.1798 1006.4283 1008.2280 1020.9331 1024.3838 1036.2296 1040.2582 1042.4460 1059.8607 1082.2800 1090.1655 1106.1219 1113.8217 1118.6495 1141.5348 1154.9879 1167.0592 1170.9567 1174.0201 1178.8499 1182.5848 1187.0462 1195.0151 1201.9678 1209.2325 1213.8418 1216.2525 1222.4547 1224.1756 1245.6855 1262.4600 1292.2941 1304.5794 1309.8530 1321.1097 1329.7704 1334.9149 1346.2229 1353.2234 1392.5611 1394.6371 1397.8868 1417.2401 1423.6537 1426.5784 1435.9357 1445.5150 1448.1179 1450.1252 1452.6505 1454.9713 1458.7472 1460.2685 1461.0428 1463.3268 1469.9819 1472.2665 1476.5265 1481.3281 1483.6634 1488.3123 1489.8173 1497.0688 1500.4096 1594.4590 1600.4122 1606.9452 1615.9192 3013.7096 3016.2605 3023.4004 3024.0022 3025.9535 3026.5258 3027.1971 3029.8972 3033.9275 3039.9223 3077.7500 3080.1878 3097.0482 3110.8451 3112.0904 3116.1812 3135.4688 3139.0252 3142.9670 3144.0361 3144.6784 3145.4566 3146.4097 3149.8427 3152.2694 3154.6161 3155.7872 3158.4719 3158.8604 3161.6544 3177.5424 3177.8792
redmass: 4.0063 3.0628 3.6282 4.5895 3.1804 2.2744 2.3167 3.8153 2.0513 1.8769 1.8733 1.9734 3.3898 1.5870 1.2096 1.1627 1.8777 2.0636 1.8497 2.3868 2.7391 2.4768 2.3781 3.8347 4.2594 2.7265 2.5626 2.6811 3.0322 3.3629 3.0757 2.6925 4.1826 3.4536 3.6935 3.0046 3.9759 3.5308 3.8638 4.6048 6.5408 3.8113 4.5006 5.0608 4.0509 1.7438 1.5745 1.7767 2.3684 2.2602 3.3920 2.4394 3.0065 3.2048 3.1952 1.3637 1.8087 2.6794 3.4198 3.1271 2.7508 2.5417 1.4271 1.4905 2.4222 2.1858 1.3453 1.3390 2.5372 2.2649 1.5889 1.2278 3.1533 2.0221 1.5348 1.4311 1.6534 1.5090 1.9254 1.5485 1.3392 2.6169 1.6052 1.3958 1.2349 1.1010 1.2124 1.4395 1.5557 1.7529 2.0562 1.7836 1.7574 1.4528 1.9111 1.8348 1.4412 1.3775 1.3755 1.4311 1.4172 1.1706 1.2300 1.2672 6.0999 6.6724 1.2216 1.1388 1.1438 1.1651 1.1069 1.1297 1.9997 1.1516 2.3123 1.0503 1.0759 1.0917 1.1904 1.7516 1.0940 1.0932 1.3296 1.5873 1.1297 1.0550 1.0510 1.0569 1.0635 6.1946 6.9885 6.8897 7.0421 1.0825 1.0646 1.0647 1.0363 1.0344 1.0449 1.0348 1.0428 1.0519 1.0581 1.0928 1.0998 1.1058 1.0902 1.0903 1.1065 1.1052 1.1059 1.0901 1.1059 1.0899 1.1054 1.1061 1.1067 1.1059 1.1057 1.1028 1.0927 1.0925 1.1035 1.1000 1.0999
irintensity: 0.7249 0.7873 3.4007 0.3752 2.7538 3.0298 0.7096 0.3685 0.0198 0.3048 0.2307 2.1354 2.5272 0.8495 0.5795 0.0460 0.8563 1.5238 0.2370 0.0755 0.1242 0.4001 0.1285 3.5699 0.0100 0.0775 0.1720 1.4358 1.1190 1.9529 0.9242 1.5881 2.3988 1.3501 1.9000 2.4534 13.9380 15.6467 7.3913 28.8830 0.8734 16.1309 0.4484 8.4290 0.9675 16.7119 30.6468 61.8526 15.8975 42.5529 0.9888 19.9001 4.5067 11.6108 21.2552 0.6565 4.6514 22.3445 0.3853 17.4954 19.6166 2.6182 1.9082 3.9224 4.2867 12.4638 0.2403 0.0679 0.8203 2.0301 0.5050 0.0270 2.6089 2.5704 0.6984 0.8353 1.0700 0.4973 9.7056 0.1776 8.0503 8.9462 2.6998 0.8364 2.6279 1.1840 0.1644 2.4351 3.8197 2.5975 3.9010 0.5416 1.4916 4.1995 3.1556 0.4353 6.9856 0.1418 0.4915 0.9236 1.0323 3.3061 10.8449 6.2273 0.3575 0.0645 0.8410 34.0423 19.5976 16.7265 6.7327 8.1604 15.7723 2.7898 1.3156 0.9360 7.5127 2.3305 6.3751 16.3184 50.2514 32.9714 4.8525 11.3193 21.8390 40.5149 56.1467 47.7467 117.8862 0.0130 0.4745 2.1239 1.5754 14.7029 29.7910 21.8594 2.1623 2.2673 23.8093 10.2668 34.8024 13.0808 6.7282 8.2475 14.0129 0.2344 5.8200 20.5936 2.2905 4.8330 0.7033 0.6532 0.4249 0.5406 0.7567 0.3323 2.5095 1.3448 4.2102 0.7555 4.3614 5.4982 8.8607 8.4310 4.7898
temp: 298.150 k
press: 1.00000 atm
elementType: 7 7 6 6 6 6 6 6 6 6 6 6 6 6 6 6 6 6 6 6 6 6 6 6 6 1 1 1 1 1 1 1 1 1 1 1 1 1 1 1 1 1 1 1 1 1 1 1 1 1 1 1 1 1 1 1 1
symmnumber: 1
zpe: 1321466.9 jmol-1
zpe.correction: 0.503320 hartree
zpe.thermalcorrener: 0.527046 hartree
zpe.thermalcorrenthalpy: 0.527990 hartree
zpe.thermalcorrgfe: 0.450609 hartree
zpe.sumelectzpe: -1002.685469 hartree
zpe.sumelectthermal: -1002.661743 hartree
zpe.sumelectthermalent: -1002.660799 hartree
zpe.sumelectthermalfe: -1002.738180 hartree
dipole: -19.3100 -2.4981 2.1392
dipole: 19.5881
quadrupole: -15.8192 -106.4185 -117.5195
quadrupole: -4.6588 12.5563 -5.3337
quadrupole: 64.0999 -26.4994 -37.6004 -4.6588 12.5563 -5.3337
hfenergy: -1003.1887892 hartree
pointgroup: C01 [X(C23H32N2)]
dipole: -7.648408 0.5487248 -0.7690925 debye
polarizability: 263.4059667|4.8825783|263.314378|-14.8273344|6.3681875|207.1274029 unknown
InChI: InChI=1S/C23H32N2/c1-24(2,3)14-15-25(4,5)22-16-21-17-10-6-8-12-19(17)23(22)20-13-9-7-11-18(20)21/h6-13,21-23H,14-16H2,1-5H3
charge 2 multiplicity 1
57 atoms
N  -1.334526 1.267052 -1.180281
N  -4.396562 -0.592067 0.541782
C  -0.205073 0.140831 -1.045469
C  0.347788 -0.085406 0.414358
C  0.984751 0.372854 -2.034791
C  2.335696 0.081292 -1.281321
C  1.349421 1.010337 0.774539
C  1.123972 -1.403906 0.263132
C  -2.492623 1.010616 -0.189842
C  2.428528 1.099279 -0.145172
C  2.201873 -1.309567 -0.656118
C  -1.861367 1.253375 -2.619432
C  -0.820531 2.684793 -0.877224
C  -3.093291 -0.411965 -0.276035
C  1.303829 1.83875 1.9136
C  0.862827 -2.603556 0.951675
C  3.453598 2.042452 0.058596
C  3.025556 -2.42438 -0.894436
C  2.340649 2.782253 2.122668
C  1.695679 -3.725864 0.714404
C  3.404307 2.887639 1.195652
C  2.766653 -3.635994 -0.204889
C  -5.540499 0.26463 -0.015408
C  -4.802165 -2.073344 0.428666
C  -4.177376 -0.257227 2.021582
H  -0.750911 -0.771168 -1.351548
H  -0.455566 -0.188163 1.167501
H  1.025127 1.407917 -2.417573
H  0.885953 -0.299077 -2.903922
H  3.178212 0.151918 -1.987321
H  -3.250261 1.779716 -0.418175
H  -2.086105 1.210795 0.81344
H  -2.173278 0.237209 -2.903375
H  -2.705024 1.957145 -2.705035
H  -1.05619 1.572299 -3.294641
H  -0.390393 2.712992 0.133181
H  -0.040935 2.953195 -1.601828
H  -1.663453 3.388275 -0.972777
H  -2.387305 -1.163613 0.11445
H  -3.354456 -0.680903 -1.313128
H  0.502317 1.736831 2.656719
H  0.057022 -2.667437 1.693997
H  4.29468 2.111291 -0.639786
H  3.8662 -2.359165 -1.593481
H  2.329673 3.420063 3.012143
H  1.521786 -4.661364 1.255425
H  4.205912 3.612219 1.369712
H  3.409459 -4.505441 -0.374328
H  -6.462135 0.014654 0.531631
H  -5.320893 1.332314 0.12892
H  -5.676681 0.038291 -1.08414
H  -5.733177 -2.228763 0.994011
H  -4.965861 -2.325117 -0.630262
H  -4.003046 -2.702206 0.849871
H  -5.089561 -0.519156 2.578627
H  -3.330698 -0.846486 2.406364
H  -3.984525 0.819159 2.138493
