program: Gaussian 09
title: 000265146
version: EM64L-G09RevD.01
frameworkgroup: C1[X(C12H17NO)]
method: RPBEPBE
basis: SDD
operation: Freq
keyword: #p
keyword: freq=noraman
keyword: PBEPBE/SDD
title: #p freq=noraman PBEPBE/SDD
converged: YES YES NO NO
title: Mulliken charges:
elementType: O N C C C C C C C C C C C C H H H H H H H H H H H H H H H H H
charge: -0.263140 -0.237548 -0.037329 -0.544564 0.227537 -0.715350 -0.712728 0.428502 -0.672252 -0.325169 -0.363879 -0.224677 -0.227862 -0.249189 0.187571 0.236182 0.229997 0.195287 0.204647 0.264914 0.195666 0.262447 0.205266 0.252466 0.253631 0.232411 0.279231 0.238930 0.226212 0.224258 0.228532
chargesum: 0.00000
title: Mulliken charges with hydrogens summed into heavy atoms:
elementType: O N C C C C C C C C C C C C
charge: -0.263140 -0.237548 0.150242 -0.078385 0.227537 -0.050502 -0.049349 0.428502 0.066256 -0.045938 -0.124949 0.001535 -0.003604 -0.020658
polarizability: 1.90432884e+02 -4.33481966e+00 1.35845676e+02 9.71723625e+00 7.89421377e+00 9.22717107e+01
1716.lowfreq: -8.1050 -3.6912 -0.0008 -0.0002 0.0003 11.4570 39.1488 42.5430 75.0089
frequency: 38.8688 42.3933 74.9313 94.3883 137.3335 166.1275 183.9019 209.2997 223.0070 242.4376 261.2574 298.2928 349.0176 360.0584 378.2468 396.2747 406.8125 458.8245 503.6727 558.9814 572.0411 613.4404 641.0694 693.9783 748.5100 763.8997 790.2209 831.6374 857.3973 895.0787 905.9965 928.1279 964.0340 964.1557 981.2281 986.0030 988.5044 1027.2556 1076.8813 1093.6309 1100.1920 1104.9789 1109.7399 1116.9493 1173.2552 1194.5956 1202.2262 1223.1235 1245.3225 1289.0140 1313.1279 1331.3576 1334.0348 1369.0458 1373.2568 1382.1236 1390.8210 1431.7959 1440.9686 1444.1697 1463.6807 1478.6223 1483.6984 1484.7508 1488.9142 1490.7359 1499.6651 1584.3984 1595.1799 1613.7507 2945.4658 2961.3848 2971.6919 2972.5344 2978.0732 3011.0724 3057.4578 3062.4781 3074.7713 3098.4443 3103.7123 3115.1686 3125.8264 3136.1343 3149.8466 3164.4793 3205.5579
redmass: 4.4615 3.4050 3.5421 3.6457 2.5232 3.2541 1.2581 3.3016 1.1421 1.0791 3.0765 5.3354 3.2628 1.9106 2.7336 3.2814 2.8605 3.1055 3.1350 3.8591 3.7566 6.1440 4.2294 1.8685 4.1222 1.8623 3.5972 1.2612 3.0529 1.6751 1.4445 1.2438 1.5335 1.3929 1.9845 2.4012 1.9282 2.3267 1.9035 1.5216 1.8907 1.5227 1.7925 1.7762 1.0512 1.1218 2.0546 3.2785 1.1706 2.5110 1.9052 1.5020 1.4797 1.4894 1.2282 8.7119 1.2564 1.0992 2.0014 1.2468 1.0427 1.0732 1.0585 2.1018 1.0532 1.0767 1.0614 6.3671 7.0704 6.4461 1.0721 1.0664 1.0440 1.0373 1.0428 1.0979 1.0989 1.0978 1.0902 1.0989 1.0982 1.1007 1.0848 1.0891 1.0940 1.1002 1.0945
irintensity: 1.0796 1.5811 0.7026 1.4615 3.2869 2.1995 0.2298 2.6267 0.1920 0.0355 0.9593 9.3079 0.8854 0.2773 4.7653 0.7847 0.6580 0.6849 8.2323 1.7183 5.9542 0.8045 11.1063 47.5171 1.2378 62.2542 2.1639 1.9844 7.3517 9.3055 5.1351 1.1772 0.3245 0.6564 33.8846 1.1220 0.2962 13.2194 63.3559 121.1170 23.7804 5.2487 4.3635 1.2155 0.2175 1.3755 1.2746 36.2026 3.9419 48.6724 171.5708 54.3419 2.4099 61.8987 28.1285 0.6053 26.2113 26.8184 4.2493 9.0362 1.6125 27.7893 1.8507 86.5425 20.5511 38.0039 21.9530 65.4130 88.1789 48.1489 21.6524 44.8827 42.0020 67.4945 35.2380 20.8066 24.5826 79.1202 22.5810 6.3047 30.7129 21.0578 1.2397 9.2874 35.6639 23.5821 0.9700
temp: 298.150 k
press: 1.00000 atm
elementType: 8 7 6 6 6 6 6 6 6 6 6 6 6 6 1 1 1 1 1 1 1 1 1 1 1 1 1 1 1 1 1
symmnumber: 1
zpe: 691410.5 jmol-1
zpe.correction: 0.263344 hartree
zpe.thermalcorrener: 0.277810 hartree
zpe.thermalcorrenthalpy: 0.278754 hartree
zpe.thermalcorrgfe: 0.221781 hartree
zpe.sumelectzpe: -596.391984 hartree
zpe.sumelectthermal: -596.377518 hartree
zpe.sumelectthermalent: -596.376574 hartree
zpe.sumelectthermalfe: -596.433548 hartree
dipole: 0.3524 3.7008 -0.9626
dipole: 3.8402
quadrupole: -78.8828 -79.1574 -87.0691
quadrupole: -3.5377 2.4843 1.8605
quadrupole: 2.8203 2.5457 -5.3660 -3.5377 2.4843 1.8605
hfenergy: -596.6553284 hartree
pointgroup: C01 [X(C12H17N1O1)]
dipole: -0.1445957 -1.4551461 -0.3798582 debye
polarizability: 188.896257|-4.0566846|135.8473765|-15.8571128|-7.4855595|93.806637 unknown
InChI: InChI=1S/C12H17NO/c1-10(2)9-12(14)13(3)11-7-5-4-6-8-11/h4-8,10H,9H2,1-3H3
charge 0 multiplicity 1
31 atoms
O  1.027482 1.235261 -0.009477
N  -0.146857 -0.749572 -0.426329
C  3.6635 0.012163 -0.245603
C  2.354914 -0.766046 -0.555584
C  1.045131 0.003507 -0.307716
C  3.882484 1.216615 -1.193262
C  3.759044 0.432171 1.241192
C  -1.442971 -0.176994 -0.136243
C  -0.106908 -2.198531 -0.73371
C  -1.767907 1.157109 -0.501374
C  -2.428963 -0.978455 0.499523
C  -3.055565 1.666762 -0.231815
C  -3.7159 -0.459656 0.759582
C  -4.038184 0.866992 0.396803
H  4.480884 -0.71619 -0.439775
H  2.346226 -1.698262 0.044779
H  2.378142 -1.085063 -1.619525
H  3.837528 0.906848 -2.255623
H  4.876056 1.669706 -1.016744
H  3.111173 1.985122 -1.021799
H  3.625768 -0.436199 1.915367
H  2.985236 1.18062 1.479809
H  4.75011 0.87459 1.453694
H  0.687674 -2.416509 -1.462992
H  -1.066956 -2.49523 -1.184735
H  0.066677 -2.819483 0.167369
H  -1.015442 1.786401 -0.977344
H  -2.191767 -2.000766 0.812404
H  -3.291348 2.697107 -0.520971
H  -4.46136 -1.092572 1.254209
H  -5.035601 1.271052 0.601088
