program: Gaussian 09
title: 000265186
version: EM64L-G09RevD.01
frameworkgroup: C1[X(C17H16N2O2S2)]
method: RPBEPBE
basis: SDD
operation: Freq
keyword: #p
keyword: freq=noraman
keyword: PBEPBE/SDD
title: #p freq=noraman PBEPBE/SDD
converged: YES YES NO NO
title: Mulliken charges:
elementType: S S O O N N C C C C C C C C C C C C C C C C C H H H H H H H H H H H H H H H H
charge: 0.879242 0.525668 -0.572469 -0.555002 -0.553267 0.012576 -0.027396 -0.284663 0.414770 -0.065670 -0.132446 -0.302228 -0.231994 -0.243294 0.453812 -0.391361 -0.340148 -0.382395 -0.311931 -0.803048 -0.242104 -0.215135 -0.801845 0.311402 0.258507 0.283318 0.269831 0.240371 0.238238 0.241769 0.263281 0.259693 0.289311 0.343115 0.235603 0.237773 0.231534 0.227705 0.238879
chargesum: 0.00000
title: Mulliken charges with hydrogens summed into heavy atoms:
elementType: S S O O N N C C C C C C C C C C C C C C C C C
charge: 0.879242 0.525668 -0.572469 -0.555002 -0.553267 0.012576 -0.027396 -0.284663 0.414770 -0.065670 0.178956 -0.043721 0.051323 0.026538 0.453812 -0.150990 -0.101910 -0.140626 -0.048650 0.089071 -0.006501 0.022638 -0.103727
polarizability: 4.54079763e+02 2.16373206e+00 2.36489415e+02 2.26884265e+01 1.45418209e+01 1.37526983e+02
1716.lowfreq: -2.5759 -0.0019 -0.0019 -0.0018 3.6857 8.6273 11.3405 17.8014 20.2140
frequency: 10.8314 17.7901 19.8818 31.6023 39.6628 59.2595 87.0019 105.9207 127.4754 139.1973 162.4884 174.7262 179.9016 187.3633 198.2369 226.2384 254.5569 262.0471 291.8603 302.2996 314.3340 331.8380 370.4157 389.5790 398.5465 407.5590 418.7927 459.2498 480.4352 491.4490 511.8630 522.5829 527.6261 555.5276 557.2455 591.8693 614.2989 622.9060 643.3177 660.9746 710.7464 749.8669 762.8556 771.5195 787.8923 795.6351 822.5322 827.3395 839.2878 849.5410 887.8873 895.5781 915.5905 961.0674 967.9993 980.3889 986.9161 987.9841 989.5798 998.2257 1000.6975 1003.0192 1016.7918 1049.3285 1056.6356 1077.7561 1117.2960 1125.9036 1160.3145 1170.0912 1183.2370 1218.2027 1240.3346 1256.5646 1289.8385 1295.1070 1301.7063 1370.1571 1380.7690 1391.6990 1399.1651 1402.1140 1422.8846 1423.9754 1456.0686 1458.3437 1471.2190 1474.4094 1474.9606 1499.1022 1557.7037 1573.8790 1595.8663 1598.7746 1623.8356 2980.6920 3007.4959 3060.8806 3090.1811 3129.6527 3131.4124 3136.8453 3140.3708 3142.5500 3154.1540 3156.4584 3159.7752 3161.3935 3165.2360 3167.0828 3173.7049
redmass: 3.8419 4.2395 1.2624 4.1924 4.9284 5.9546 5.3671 6.2710 4.9575 6.1104 7.1977 1.9127 3.9163 1.5411 4.4792 6.2783 9.8148 7.0164 5.5379 4.8589 5.7881 6.9774 5.3447 5.2818 3.7094 2.8553 5.1994 5.9143 3.0167 6.7569 7.1774 3.7763 4.3944 7.6339 8.0788 6.2532 7.8441 6.9672 14.6998 4.0061 3.2640 5.6667 1.3270 6.3745 6.8036 3.0948 5.6279 1.3958 1.4080 1.2492 2.2226 4.3755 5.2191 1.3112 1.3586 1.3900 1.4188 1.4945 1.2748 3.4670 1.3401 1.2309 2.2228 1.5851 2.5025 3.5358 1.2818 1.8448 1.2444 1.1138 1.1452 2.9656 2.0942 1.7238 2.2611 1.2666 1.1785 3.2737 4.7060 3.1540 1.2812 4.2574 1.3087 1.5667 2.8711 1.0683 1.0586 2.0524 1.1850 3.6326 8.0468 6.0384 6.8202 6.1648 6.5274 1.0378 1.0252 1.0966 1.0993 1.0871 1.0891 1.0894 1.0899 1.0896 1.1085 1.0997 1.0951 1.0952 1.0963 1.1065 1.0999
irintensity: 1.6107 1.8713 0.5762 0.3998 3.2503 1.1240 2.4022 0.0738 2.2608 3.2254 3.0117 3.9881 2.0823 1.6366 1.3155 20.7360 6.0897 17.5959 5.0051 3.4444 1.7270 13.4295 6.0256 14.4995 2.0744 0.1263 40.8633 103.5417 11.3382 21.5653 2.7252 53.6839 42.4602 1.5867 2.0168 48.7657 20.4050 0.3424 80.9199 1.5772 0.5775 1.6620 53.5461 22.9447 32.3791 7.7576 15.8839 39.1159 93.3715 1.4095 30.1755 44.7585 15.5934 0.6415 2.5394 0.6589 7.4035 5.5564 39.0516 4.9885 0.0384 15.2287 5.2791 18.8779 32.5954 62.1836 8.7734 28.0120 0.7798 0.6353 19.0293 7.6420 4.4399 5.7019 7.0272 2.1623 21.8372 22.6498 2.4384 9.0216 12.5808 13.1744 27.1519 6.0977 13.4821 19.8693 14.2810 27.3148 16.1900 63.5272 38.8087 49.9207 1.1185 7.0518 11.3595 34.3998 17.1767 18.7080 17.3050 1.3143 14.3864 15.3495 20.8666 12.1580 6.9284 35.7031 22.4521 2.5679 12.3107 1.6188 24.8352
temp: 298.150 k
press: 1.00000 atm
elementType: 16 16 8 8 7 7 6 6 6 6 6 6 6 6 6 6 6 6 6 6 6 6 6 1 1 1 1 1 1 1 1 1 1 1 1 1 1 1 1
symmnumber: 1
zpe: 755638.1 jmol-1
zpe.correction: 0.287807 hartree
zpe.thermalcorrener: 0.310555 hartree
zpe.thermalcorrenthalpy: 0.311499 hartree
zpe.thermalcorrgfe: 0.232040 hartree
zpe.sumelectzpe: -1711.606025 hartree
zpe.sumelectthermal: -1711.583277 hartree
zpe.sumelectthermalent: -1711.582333 hartree
zpe.sumelectthermalfe: -1711.661792 hartree
dipole: 1.5559 1.3334 -0.6752
dipole: 2.1575
quadrupole: -90.8608 -136.3945 -162.4417
quadrupole: -6.1043 4.1194 5.9761
quadrupole: 39.0382 -6.4955 -32.5427 -6.1043 4.1194 5.9761
hfenergy: -1711.8938319 hartree
pointgroup: C01 [X(C17H16N2O2S2)]
dipole: 0.6038903 -0.5949756 0.0426184 debye
polarizability: 429.2260488|-3.9658291|229.6248139|-85.7500287|32.7646935|169.245299 unknown
InChI: InChI=1S/C17H16N2O2S2/c1-13-7-10-15(11-8-13)23(20,21)19-22(2)17-12-9-14-5-3-4-6-16(14)18-17/h3-12H,1-2H3
charge 0 multiplicity 1
39 atoms
S  -1.364351 0.771879 -0.07144
S  0.709683 -1.421779 0.682253
O  -1.311356 0.149328 -1.595156
O  -0.787029 2.289823 0.169119
N  -0.664903 -0.435261 1.228279
N  3.136816 -1.027908 -0.544167
C  -3.155251 0.793173 0.507615
C  2.172053 -0.335768 0.041605
C  4.366495 1.100487 -0.790201
C  4.261464 -0.333763 -0.977239
C  2.155444 1.066329 0.286283
C  3.277186 1.778172 -0.148675
C  -3.547929 1.794452 1.407519
C  -4.036609 -0.175692 0.001022
C  -5.828895 0.855089 1.346829
C  -4.898612 1.81414 1.824151
C  -5.380221 -0.133378 0.4288
C  5.542195 1.773439 -1.254547
C  5.322993 -1.047864 -1.61286
C  0.345218 -2.3801 -0.949551
C  6.56817 1.055529 -1.873889
C  6.457983 -0.361219 -2.053066
C  -7.282087 0.893782 1.784624
H  1.294346 1.560539 0.746128
H  3.320421 2.86413 -0.010462
H  -2.823032 2.53949 1.750217
H  -3.686475 -0.921243 -0.719948
H  -5.231447 2.585183 2.528299
H  -6.08982 -0.876504 0.046125
H  5.624772 2.858133 -1.118639
H  5.21612 -2.129426 -1.738734
H  -0.273847 -3.237292 -0.6501
H  1.333294 -2.686607 -1.322653
H  -0.181939 -1.68363 -1.617767
H  7.465228 1.574522 -2.227967
H  7.272553 -0.907324 -2.540835
H  -7.639312 -0.107722 2.085707
H  -7.431684 1.579121 2.636087
H  -7.935041 1.237937 0.959838
