program: Gaussian 09
title: 000265159
version: EM64L-G09RevD.01
frameworkgroup: C1[X(C13H22O4)]
method: RPBEPBE
basis: SDD
operation: Freq
keyword: #pfreq=noraman
keyword: PBEPBE/SDD
title: #p freq=noraman PBEPBE/SDD
converged: YES YES NO NO
title: Mulliken charges:
elementType: O O O O C C C C C C C C C C C C C H H H H H H H H H H H H H H H H H H H H H H
charge: -0.288090 -0.296966 -0.281353 -0.258056 -0.027328 0.302330 -0.471305 -0.480588 -0.409906 -0.372229 -0.492661 0.019396 -0.312306 -0.336304 -0.726633 0.296722 -0.760137 0.241777 0.211454 0.218971 0.207847 0.221798 0.191823 0.204652 0.214382 0.198181 0.226754 0.222575 0.248918 0.204557 0.222422 0.207132 0.232167 0.220827 0.244991 0.215435 0.248588 0.246357 0.243805
chargesum: 0.00000
title: Mulliken charges with hydrogens summed into heavy atoms:
elementType: O O O O C C C C C C C C C C C C C
charge: -0.288090 -0.296966 -0.281353 -0.258056 0.214450 0.302330 -0.040880 -0.050943 -0.013431 0.040335 -0.043333 0.268314 0.114673 0.102995 -0.045379 0.296722 -0.021387
polarizability: 1.63435213e+02 -9.64287276e+00 1.50529180e+02 3.32322739e-01 1.86735864e+00 1.28909373e+02
1716.lowfreq: -8.5723 -5.8027 0.0002 0.0004 0.0007 8.3986 19.8248 30.8485 49.6135
frequency: 19.3916 30.5963 49.5808 50.6895 78.9145 84.2238 115.5865 123.8052 159.8830 178.1996 186.7343 213.0078 224.2141 249.8592 278.7982 286.9991 341.7763 350.0579 395.2991 418.3581 431.3313 452.2688 490.7034 519.7741 558.4880 575.1761 604.6191 618.7724 640.7530 708.5849 756.1364 784.6079 814.8054 836.1873 864.0297 867.5309 890.2019 894.2976 916.6206 927.9391 937.3255 959.4462 983.6342 985.9669 997.4126 1007.8228 1034.2528 1043.9909 1052.7719 1081.2139 1090.4967 1103.9669 1109.3960 1131.3735 1141.8179 1152.9336 1159.1056 1168.9919 1195.3086 1203.5432 1214.3293 1244.7253 1253.2787 1268.6184 1281.6542 1306.9765 1315.2690 1325.4995 1329.4606 1329.7312 1334.1589 1335.3992 1343.1906 1349.8854 1367.0427 1382.3339 1383.7211 1451.8716 1454.6688 1454.9698 1456.8633 1459.5389 1464.4000 1465.3985 1473.4172 1474.4040 1477.3803 1486.6733 1637.3096 2965.1166 2978.5254 2979.8438 2984.1131 2985.3320 2986.3165 2988.9603 2991.7501 2995.7395 3004.5657 3028.6911 3032.5935 3040.3967 3046.2796 3055.3459 3057.7611 3078.1712 3085.1704 3096.8214 3097.8909 3098.4441 3136.7892
redmass: 4.0725 7.0305 3.4155 1.0617 3.4052 3.0683 3.0609 3.5194 2.7626 3.1209 3.6304 1.1839 2.7608 2.6905 2.6615 2.0715 2.4629 3.5275 3.6441 2.9430 3.5602 2.7552 2.2160 3.2550 2.8629 3.0675 3.8017 2.4647 3.7888 6.0331 3.3425 1.7993 2.3238 2.1288 2.1402 2.4045 1.6603 4.1775 3.0453 1.8935 1.6873 2.3476 3.5503 3.3701 1.7431 1.6965 2.6291 1.6593 1.8884 2.1797 1.6055 1.7931 1.6262 2.1953 1.9145 2.6022 1.4280 1.5138 1.2803 2.9527 1.6703 1.5034 1.3220 1.4988 1.2803 1.3349 1.3896 1.3779 1.2509 1.2912 1.4482 1.4333 1.4203 1.5112 1.5934 1.2355 1.2292 1.0838 1.0746 1.0794 1.0529 1.0865 1.0841 1.0564 1.0894 1.0891 1.0458 1.0900 9.7718 1.0636 1.0631 1.0700 1.0598 1.0593 1.0496 1.0560 1.0627 1.0699 1.0379 1.0880 1.0953 1.1007 1.1018 1.1005 1.1024 1.0995 1.0984 1.1012 1.0944 1.1006 1.1025
irintensity: 0.1530 1.6033 1.6945 0.4986 2.3609 3.5806 0.6272 4.4302 2.9640 6.0624 0.4725 1.7005 5.1495 0.0806 4.4418 1.9542 0.6013 5.2879 6.1762 8.9835 12.0315 1.3030 4.5955 2.8637 1.3174 4.5564 3.5452 1.5652 4.2729 6.3837 3.0992 12.4513 5.0174 26.1404 13.9513 14.4285 0.8690 49.7433 22.3918 20.2884 9.2065 5.2798 13.4034 14.4752 45.0504 44.7878 48.1967 15.9325 115.7188 18.6762 31.2926 12.4168 6.5183 19.3476 14.5180 27.6348 15.7511 10.2322 3.7221 295.1699 38.3202 17.1945 7.5882 20.9313 6.3179 1.9827 2.6661 9.4523 2.6547 1.6844 0.9947 0.3565 3.7698 4.6835 3.3404 54.3454 21.1648 4.0747 23.8152 2.5318 16.0035 11.2552 16.2516 10.0406 7.1962 5.4046 10.9172 1.8842 185.1199 35.5462 19.4209 49.6625 79.0758 2.9356 6.8704 27.7291 24.4310 53.5640 3.5931 7.6134 60.2800 44.4298 14.9036 10.3546 75.7289 42.2681 36.8706 30.0202 9.6238 21.4294 9.6128
temp: 298.150 k
press: 1.00000 atm
elementType: 8 8 8 8 6 6 6 6 6 6 6 6 6 6 6 6 6 1 1 1 1 1 1 1 1 1 1 1 1 1 1 1 1 1 1 1 1 1 1
symmnumber: 1
zpe: 875465.3 jmol-1
zpe.correction: 0.333447 hartree
zpe.thermalcorrener: 0.351605 hartree
zpe.thermalcorrenthalpy: 0.352549 hartree
zpe.thermalcorrgfe: 0.285585 hartree
zpe.sumelectzpe: -808.115951 hartree
zpe.sumelectthermal: -808.097793 hartree
zpe.sumelectthermalent: -808.096849 hartree
zpe.sumelectthermalfe: -808.163813 hartree
dipole: 2.4791 -1.4797 0.9715
dipole: 3.0461
quadrupole: -102.0990 -95.2114 -106.0543
quadrupole: -1.9263 -7.9310 4.3650
quadrupole: -0.9774 5.9102 -4.9328 -1.9263 -7.9310 4.3650
hfenergy: -808.4493978 hartree
pointgroup: C01 [X(C13H22O4)]
dipole: 0.9735857 -0.6429673 0.2738333 debye
polarizability: 163.1959893|-9.6364831|149.6735018|-1.6280918|5.1802358|130.0042745 unknown
InChI: InChI=1S/C13H22O4/c1-10(17-11(2)14)9-12-5-3-4-6-13(12)15-7-8-16-13/h10,12H,3-9H2,1-2H3
charge 0 multiplicity 1
39 atoms
O  1.960594 -1.239365 1.217499
O  2.501975 -0.464824 -0.962941
O  -2.470393 -0.495161 0.476183
O  -4.175594 0.724554 -0.555346
C  0.344478 0.238759 -0.004806
C  1.830037 -0.062397 0.301012
C  0.244594 1.521774 -0.875551
C  2.558143 1.125513 0.952757
C  0.952854 2.725669 -0.209848
C  2.434006 2.404316 0.092701
C  -0.357857 -0.99062 -0.626157
C  -1.86145 -0.811312 -0.870986
C  2.687491 -2.304671 0.494568
C  3.450069 -1.53744 -0.602118
C  -2.544905 -2.066401 -1.428297
C  -3.639212 0.268423 0.482517
C  -4.160742 0.439648 1.894404
H  -0.132735 0.442038 0.975437
H  -0.818217 1.77128 -1.05422
H  0.705748 1.32015 -1.863188
H  3.618878 0.854394 1.110422
H  2.112507 1.289016 1.953248
H  0.42963 2.980863 0.735256
H  0.881885 3.614493 -0.865774
H  2.975937 2.248131 -0.860567
H  2.91926 3.252787 0.611848
H  -0.21123 -1.858504 0.044774
H  0.11933 -1.231217 -1.595799
H  -2.073467 0.052037 -1.527909
H  1.971006 -3.027537 0.057004
H  3.344451 -2.815008 1.218211
H  4.398206 -1.111598 -0.217038
H  3.641757 -2.121918 -1.515518
H  -2.415436 -2.919515 -0.738672
H  -3.622822 -1.889757 -1.583134
H  -2.098804 -2.336377 -2.403096
H  -3.35688 0.310411 2.634557
H  -4.938393 -0.321708 2.08902
H  -4.6281 1.431574 1.998442
