program: Gaussian 09
title: 000024510
version: EM64L-G09RevD.01
frameworkgroup: C1[X(C13H17NO2)]
method: RPBEPBE
basis: SDD
operation: Freq
keyword: #p
keyword: freq=noraman
keyword: PBEPBE/SDD
title: #p freq=noraman PBEPBE/SDD
converged: YES YES NO NO
title: Mulliken charges:
elementType: O O N C C C C C C C C C C C C C H H H H H H H H H H H H H H H H H
charge: -0.313289 -0.329990 -0.684506 0.009603 -0.449563 -0.435044 -0.384349 -0.392805 -0.383662 0.245255 0.064681 0.324366 -0.318675 -0.396869 -0.268519 -0.195533 0.244388 0.243533 0.198687 0.192625 0.216489 0.212686 0.197446 0.198117 0.210280 0.187679 0.201477 0.262096 0.217810 0.228061 0.223819 0.374347 0.299361
chargesum: 0.00000
title: Mulliken charges with hydrogens summed into heavy atoms:
elementType: O O N C C C C C C C C C C C C C
charge: -0.313289 -0.329990 -0.010798 0.253991 -0.007343 -0.025930 0.025784 0.015592 0.005493 0.245255 0.064681 0.324366 -0.056578 -0.179059 -0.040459 0.028287
polarizability: 2.05340157e+02 4.32793896e+00 1.65152125e+02 9.75661011e+00 -1.02896835e+00 9.66052797e+01
1716.lowfreq: -21.6336 -8.6272 -0.0010 -0.0008 -0.0006 4.4772 25.1255 37.7824 68.8138
frequency: 22.6641 37.3818 68.7812 90.6103 141.1274 150.0277 193.8172 219.8395 243.0326 285.9605 328.1851 368.8979 392.4061 411.9451 424.6040 461.5050 463.7859 471.7408 482.6997 525.4467 553.7049 637.0449 655.5989 678.0025 731.0854 758.6918 764.5657 773.1102 780.2911 797.5558 810.9313 851.0509 854.0156 864.3467 873.0596 896.5784 925.2582 961.7646 982.6510 1011.2720 1020.1057 1042.1942 1048.8765 1051.3324 1060.9986 1087.0188 1117.2154 1120.9576 1153.1360 1164.1432 1174.6554 1234.1174 1251.3198 1258.7456 1270.7287 1287.1425 1316.7284 1325.0361 1330.9268 1332.2222 1339.2999 1351.2176 1359.6058 1361.5802 1403.3715 1443.4674 1448.2904 1459.2601 1461.6223 1470.2420 1476.4172 1485.0085 1533.2770 1577.8714 1615.9636 1634.2325 2961.1817 2975.9340 2980.8667 2984.0050 2985.4353 3029.0876 3036.4304 3039.1568 3046.2723 3051.8450 3057.4970 3118.7855 3139.6992 3156.6997 3177.9249 3400.1168 3648.6771
redmass: 3.8012 4.0157 3.7706 5.3529 5.6050 3.8880 2.5730 3.4170 3.8778 3.0263 2.5379 3.1682 2.4416 4.9870 2.6473 1.4160 2.2100 3.0286 2.4095 3.1182 6.6948 2.9557 6.0281 4.4399 1.3255 1.6448 3.9009 1.6855 1.9134 2.9179 3.5117 4.3481 1.5085 2.1843 1.8370 3.0002 1.4042 1.3613 1.3218 2.7977 2.4352 3.1689 1.5934 1.5401 1.9774 1.6246 1.0331 2.0585 1.3020 1.7173 1.0591 1.3026 2.5076 1.2565 1.2840 1.8435 1.7152 1.5848 1.9640 1.4053 1.4508 1.4613 1.4740 1.4202 6.1199 3.0006 1.0907 1.0860 1.0910 1.0830 1.0931 2.5110 4.0542 6.9311 1.4681 7.1912 1.0638 1.0648 1.0620 1.0622 1.0623 1.0947 1.0894 1.0991 1.0989 1.1003 1.1003 1.0863 1.0918 1.0931 1.0979 1.0561 1.0944
irintensity: 0.0290 1.2570 1.0189 0.8383 0.1176 0.5938 2.6499 1.8333 2.3098 6.6340 8.5168 5.4864 0.4946 1.6197 27.9879 89.0048 12.8596 20.0749 7.7796 22.3731 1.4018 0.1291 10.5133 16.7799 84.2535 126.4924 3.5940 1.1384 4.8692 3.0509 4.5591 4.5058 1.9971 9.8688 12.4560 39.9804 9.6773 1.8133 0.0353 27.7108 15.0421 195.8229 19.8775 5.1473 145.0662 3.3860 0.8159 14.5622 16.2914 11.5262 33.5591 16.5783 465.9425 21.4792 23.3184 13.0088 3.6883 25.4734 8.3243 1.7616 0.8381 6.8713 2.0860 3.2565 8.7856 3.3752 10.0954 8.9225 10.8164 21.1182 8.4798 39.0450 244.7095 87.9300 118.5183 203.3878 42.6171 9.8806 46.0495 17.1339 36.1931 76.0474 6.9096 63.6214 29.6274 33.2840 91.5346 8.2228 23.5148 17.8975 13.2653 113.8013 57.2143
temp: 298.150 k
press: 1.00000 atm
elementType: 8 8 7 6 6 6 6 6 6 6 6 6 6 6 6 6 1 1 1 1 1 1 1 1 1 1 1 1 1 1 1 1 1
symmnumber: 1
zpe: 728543.6 jmol-1
zpe.correction: 0.277488 hartree
zpe.thermalcorrener: 0.291934 hartree
zpe.thermalcorrenthalpy: 0.292878 hartree
zpe.thermalcorrgfe: 0.235088 hartree
zpe.sumelectzpe: -709.618034 hartree
zpe.sumelectthermal: -709.603588 hartree
zpe.sumelectthermalent: -709.602644 hartree
zpe.sumelectthermalfe: -709.660434 hartree
dipole: 0.1971 0.0738 0.2418
dipole: 0.3205
quadrupole: -76.5456 -91.7099 -98.4327
quadrupole: -2.9470 3.0040 -0.7465
quadrupole: 12.3505 -2.8138 -9.5366 -2.9470 3.0040 -0.7465
hfenergy: -709.895522 hartree
pointgroup: C01 [X(C13H17N1O2)]
dipole: 0.0835318 0.0270464 0.0905203 debye
polarizability: 206.3711592|2.2152174|164.6932363|4.2394059|-3.2635192|96.0331661 unknown
InChI: InChI=1S/C13H17NO2/c14-12-9-5-4-8-11(12)13(15)16-10-6-2-1-3-7-10/h4-5,8-10H,1-3,6-7,14H2
charge 0 multiplicity 1
33 atoms
O  -0.828132 -0.052467 -0.29863
O  0.203446 -2.131223 -0.0951
N  2.868268 -2.171632 0.164749
C  -2.164733 -0.747053 -0.374338
C  -2.669922 -1.036424 1.054366
C  -3.086101 0.210715 -1.146446
C  -2.972797 0.26137 1.838917
C  -3.397149 1.501034 -0.35039
C  -3.9497 1.174107 1.058348
C  0.296799 -0.861223 -0.145799
C  1.554969 -0.098122 -0.061429
C  2.811582 -0.794476 0.094537
C  1.548525 1.325091 -0.12931
C  4.011258 -0.016903 0.176153
C  2.734619 2.069177 -0.047566
C  3.970805 1.382154 0.1065
H  -2.005004 -1.693698 -0.922365
H  -1.930785 -1.664066 1.583907
H  -3.596698 -1.639867 0.961207
H  -4.030472 -0.333515 -1.352873
H  -2.627803 0.452263 -2.123321
H  -2.025684 0.808263 2.014587
H  -3.390423 0.008019 2.832127
H  -4.119659 2.121604 -0.914469
H  -2.468209 2.095323 -0.248312
H  -4.93044 0.662564 0.959585
H  -4.131951 2.109332 1.622145
H  0.583578 1.825312 -0.249911
H  4.970334 -0.535863 0.29477
H  2.710756 3.16182 -0.101456
H  4.906341 1.949997 0.171845
H  1.984483 -2.691539 0.09993
H  3.761199 -2.644374 0.27634
