program: Gaussian 09
title: 000265139
version: EM64L-G09RevD.01
frameworkgroup: C1[X(C12H12O3)]
method: RPBEPBE
basis: SDD
operation: Freq
keyword: #pfreq=noraman
keyword: PBEPBE/SDD
title: #p freq=noraman PBEPBE/SDD
converged: NO NO NO NO
title: Mulliken charges:
elementType: O O O C C C C C C C C C C C C H H H H H H H H H H H H
charge: -0.197886 -0.152711 -0.152715 0.163598 0.163547 -0.545494 -0.526466 -0.526458 -0.545486 0.139480 0.139501 -0.192754 -0.205658 -0.205662 -0.192751 0.251435 0.240951 0.241205 0.252823 0.241204 0.252829 0.251433 0.240952 0.213924 0.218616 0.218620 0.213924
chargesum: 0.00000
title: Mulliken charges with hydrogens summed into heavy atoms:
elementType: O O O C C C C C C C C C C C C
charge: -0.197886 -0.152711 -0.152715 0.163598 0.163547 -0.053107 -0.032438 -0.032426 -0.053101 0.139480 0.139501 0.021170 0.012958 0.012958 0.021173
polarizability: 1.22918519e+02 -2.94391530e-03 1.09726764e+02 -1.02903471e+01 5.77679304e-03 1.30518434e+02
1716.lowfreq: -0.0007 -0.0005 -0.0003 14.6488 15.5767 16.2565 76.2284 99.8714 105.2841
frequency: 76.2058 99.8626 105.2533 143.8541 182.0760 226.1781 243.6303 289.1573 301.9461 349.7984 372.2424 383.3450 400.4719 466.4752 482.2833 545.0147 570.5904 627.2958 639.5514 660.0905 678.3104 690.7313 699.9990 735.9428 798.9323 800.1708 858.3164 863.9183 882.8956 912.4422 933.6559 935.1891 975.0417 975.2433 1002.3955 1006.1073 1016.5941 1050.0094 1072.8394 1078.6273 1102.9567 1140.4108 1144.0610 1185.9410 1206.8321 1240.1337 1241.6283 1284.7024 1295.4464 1327.7126 1328.3240 1344.2131 1347.9568 1372.8056 1376.6552 1447.8733 1452.6597 1467.7638 1469.6850 1686.6616 1687.2034 1692.6189 1760.4720 2969.0135 2969.5168 2972.8176 2972.9717 3016.7031 3017.9569 3026.4329 3026.5088 3108.6195 3108.6510 3138.3558 3139.0211
redmass: 3.6082 5.1744 3.0653 10.8056 3.0997 3.4044 3.4965 3.0176 4.9365 4.1890 2.1522 2.1691 5.3759 7.7145 4.0680 5.2540 9.4343 2.1750 5.4859 1.3090 2.4157 5.7575 3.3594 6.8077 3.5923 8.9399 2.9594 2.2014 2.2420 2.6305 2.9768 2.6114 1.2326 1.2406 2.2031 2.3835 2.8599 2.8143 3.0814 3.3195 3.9520 1.6751 1.7660 1.0394 1.1222 1.2115 1.1822 1.6744 1.8837 1.5058 1.6490 1.7253 1.5809 1.5929 1.6154 1.0824 1.0851 1.0859 1.0780 6.7282 6.6106 11.8718 12.4818 1.0637 1.0639 1.0607 1.0603 1.0994 1.0994 1.0964 1.0966 1.0843 1.0843 1.0998 1.0996
irintensity: 0.0748 0.1488 1.9554 4.1902 0.7692 1.7788 2.1291 7.5037 0.5066 1.8698 1.0609 0.0151 0.8313 1.6949 10.5679 6.3678 1.9899 17.6963 0.1911 59.9283 39.4890 5.3098 6.4793 17.6715 8.9765 236.7968 44.5919 0.3103 6.8392 5.0770 6.2446 0.1138 0.1278 0.0134 7.3819 16.2786 0.6504 4.9702 5.0151 42.5218 69.8755 16.9048 24.2444 1.3425 1.1743 0.9947 5.0371 13.9895 0.1831 2.9230 0.7201 2.5240 3.5823 0.0000 0.3499 33.1730 2.3606 13.5057 9.0259 40.0545 6.2347 407.6957 98.7115 13.3852 15.0298 27.1036 9.8831 6.6051 4.7781 21.8324 7.8167 1.6341 7.5145 57.8422 24.4703
temp: 298.150 k
press: 1.00000 atm
elementType: 8 8 8 6 6 6 6 6 6 6 6 6 6 6 6 1 1 1 1 1 1 1 1 1 1 1 1
symmnumber: 1
zpe: 557483.5 jmol-1
zpe.correction: 0.212334 hartree
zpe.thermalcorrener: 0.224573 hartree
zpe.thermalcorrenthalpy: 0.225517 hartree
zpe.thermalcorrgfe: 0.174586 hartree
zpe.sumelectzpe: -689.034823 hartree
zpe.sumelectthermal: -689.022584 hartree
zpe.sumelectthermalent: -689.021640 hartree
zpe.sumelectthermalfe: -689.072571 hartree
dipole: -0.0008 -5.4322 0.0005
dipole: 5.4322
quadrupole: -91.6004 -97.5604 -81.8466
quadrupole: 0.0002 7.4662 0.0009
quadrupole: -1.2646 -7.2246 8.4892 0.0002 7.4662 0.0009
hfenergy: -689.2471572 hartree
pointgroup: C01[X(C12H12O3)]
dipole: -0.0018619 -2.1371877 0.0039724 debye
polarizability: 121.202442|-0.0273834|109.7268875|-9.4817521|0.0522615|132.2343875 unknown
InChI: InChI=1S/C12H12O3/c13-9-11-5-1-2-6-12(11,10(14)15-9)8-4-3-7-11/h1-4H,5-8H2
charge 0 multiplicity 1
27 atoms
O  0.001664 2.196332 -0.004161
O  1.704581 1.812907 -1.570472
O  -1.701782 1.821781 1.563719
C  0.271198 -0.087411 -0.736834
C  -0.271736 -0.084121 0.737159
C  1.312329 -1.183532 -1.050539
C  -0.910967 -0.158965 -1.773743
C  0.910337 -0.153609 1.774314
C  -1.314687 -1.177304 1.055102
C  0.813322 1.343059 -0.859217
C  -0.811483 1.347691 0.85408
C  2.145546 -1.62762 0.1324
C  -1.962696 -1.182064 -1.394394
C  1.960345 -1.179936 1.398951
C  -2.148663 -1.624522 -0.126122
H  1.976858 -0.808645 -1.855456
H  0.785947 -2.063313 -1.471396
H  -0.480129 -0.394243 -2.765571
H  -1.398087 0.831975 -1.886483
H  0.479128 -0.38428 2.767062
H  1.399123 0.836951 1.88315
H  -1.978572 -0.798225 1.858584
H  -0.789779 -2.056358 1.47931
H  2.935333 -2.361587 -0.074916
H  -2.612458 -1.544885 -2.201323
H  2.609508 -1.540716 2.207275
H  -2.939676 -2.356361 0.084018
