program: Gaussian 09
title: 000265134
version: EM64L-G09RevD.01
frameworkgroup: C1[X(C11H14O3)]
method: RPBEPBE
basis: SDD
operation: Freq
keyword: #pfreq=noraman
keyword: PBEPBE/SDD
title: #p freq=noraman PBEPBE/SDD
converged: YES YES NO NO
title: Mulliken charges:
elementType: O O O C C C C C C C C C C C H H H H H H H H H H H H H H
charge: -0.295015 -0.415150 -0.231634 -0.295294 0.247797 0.321302 0.241975 -0.710221 -0.442076 -0.386773 0.176401 -0.851344 -0.232394 -0.536370 0.251366 0.252347 0.210484 0.235130 0.230984 0.238346 0.231241 0.233796 0.240390 0.222912 0.220852 0.221725 0.249288 0.369938
chargesum: 0.00000
title: Mulliken charges with hydrogens summed into heavy atoms:
elementType: O O O C C C C C C C C C C C
charge: -0.295015 -0.045212 -0.231634 -0.043927 0.247797 0.321302 0.241975 -0.012261 -0.211093 -0.148427 0.176401 -0.145917 -0.009482 0.155494
polarizability: 1.53166472e+02 5.33510660e+00 1.38256616e+02 8.55555370e+00 -2.63771338e+00 8.78677546e+01
1716.lowfreq: -8.1836 -4.7125 -0.0008 -0.0006 0.0006 11.5396 46.9395 66.4678 77.8892
frequency: 46.9108 66.4625 77.8824 86.0000 132.5295 170.7419 175.3674 194.3528 203.0931 217.6952 244.1776 260.7754 305.9406 338.2891 353.6661 441.4648 456.6263 496.2367 521.7182 550.5211 562.9916 573.2366 600.1753 649.2359 711.4790 742.8532 775.5084 784.2517 831.8865 869.1413 882.2986 961.2198 987.0107 988.7724 1025.5797 1041.4575 1062.2290 1069.6765 1098.4676 1113.3043 1118.1167 1154.5903 1181.6520 1198.4155 1237.6280 1258.4272 1265.6447 1282.4584 1316.8576 1384.9454 1385.3173 1399.6660 1430.3065 1449.4092 1462.3083 1462.9761 1467.3716 1473.9211 1476.7301 1482.4368 1488.6372 1592.4097 1609.1508 1661.4349 2961.0106 2972.7214 2996.9276 2999.5748 3048.6592 3049.4772 3084.3131 3095.5274 3114.0281 3125.0669 3125.7715 3145.8316 3167.1375 3517.0204
redmass: 4.1874 8.5446 3.0096 5.4360 3.9352 3.3761 1.1519 1.1084 1.5056 2.6299 2.5922 1.8369 4.7760 3.8800 3.6719 3.6040 4.1129 3.9319 5.3302 3.5469 3.2620 3.6105 1.8223 2.7317 4.6708 1.9663 2.3205 2.9120 2.9400 1.3624 3.6958 1.3160 2.2493 1.8623 2.6971 1.5759 1.9270 3.1926 1.6330 1.2683 2.3648 1.3652 1.2711 2.1992 2.1321 1.6504 2.3183 1.6182 1.9845 1.6352 2.0252 1.4027 1.3385 1.5820 1.4266 1.5265 1.0539 1.0615 1.0577 1.0947 1.3241 6.3754 7.1802 8.8156 1.0327 1.0379 1.0686 1.0463 1.0978 1.1039 1.0977 1.1007 1.1001 1.0930 1.0928 1.0929 1.0969 1.0639
irintensity: 0.2114 0.8700 3.5836 2.1785 2.4484 0.3894 1.1528 0.0589 0.3174 0.6040 2.6682 0.7749 1.9366 0.5496 0.8134 7.0510 26.3147 0.4969 1.0382 5.4351 32.2141 5.1091 55.4812 70.0797 14.2968 18.9866 25.8001 31.6794 1.2482 0.1857 2.5448 0.3662 49.1950 15.3066 143.3863 34.0057 23.0637 73.1573 1.1760 1.9221 60.7678 0.9384 4.3636 39.9366 60.9469 5.1254 30.2926 4.1071 23.5197 18.1832 18.2854 4.6279 13.4273 33.6100 9.8722 1.1920 13.5480 48.9085 12.1260 6.7215 32.4730 27.1907 16.5353 263.7868 68.0756 27.6927 18.0003 19.6396 13.1289 47.3774 25.1897 23.6936 15.7716 8.6614 14.5131 25.8711 18.0240 17.5075
temp: 298.150 k
press: 1.00000 atm
elementType: 8 8 8 6 6 6 6 6 6 6 6 6 6 6 1 1 1 1 1 1 1 1 1 1 1 1 1 1
symmnumber: 1
zpe: 594036.2 jmol-1
zpe.correction: 0.226256 hartree
zpe.thermalcorrener: 0.240805 hartree
zpe.thermalcorrenthalpy: 0.241750 hartree
zpe.thermalcorrgfe: 0.185061 hartree
zpe.sumelectzpe: -652.185487 hartree
zpe.sumelectthermal: -652.170938 hartree
zpe.sumelectthermalent: -652.169994 hartree
zpe.sumelectthermalfe: -652.226682 hartree
dipole: -1.7832 1.3308 -0.5444
dipole: 2.2907
quadrupole: -87.9718 -67.7049 -82.4941
quadrupole: 3.4726 -3.7882 -0.7899
quadrupole: -8.5816 11.6854 -3.1038 3.4726 -3.7882 -0.7899
hfenergy: -652.4117432 hartree
pointgroup: C01 [X(C11H14O3)]
dipole: -0.7120144 -0.5289948 0.1594326 debye
polarizability: 152.7587604|-4.5962905|138.3839326|-9.7522752|3.530268|88.1481493 unknown
InChI: InChI=1S/C11H14O3/c1-7-5-4-6-9(14-3)10(7)8(2)11(12)13/h4-6,8,12H,1-3H3
charge 0 multiplicity 1
28 atoms
O  0.860494 -1.528409 -0.47564
O  1.665656 0.405119 1.912594
O  3.25607 0.523344 0.231329
C  0.912215 1.220409 -0.241859
C  -0.398115 0.451448 -0.065324
C  -1.628836 1.113987 0.192363
C  -0.40289 -0.964668 -0.222331
C  1.328181 1.33667 -1.730053
C  -2.824262 0.352022 0.287194
C  -1.591689 -1.720824 -0.124958
C  2.068142 0.661996 0.591554
C  -1.694331 2.622589 0.378251
C  -2.806261 -1.047939 0.131405
C  0.9652 -2.983984 -0.572832
H  0.758357 2.243262 0.155866
H  1.498319 0.335195 -2.156509
H  0.531784 1.839421 -2.306416
H  2.263586 1.91342 -1.828763
H  -3.770863 0.86624 0.487565
H  -1.583075 -2.807974 -0.244977
H  -1.303947 3.168334 -0.501565
H  -2.736251 2.948443 0.535636
H  -1.107553 2.951112 1.257278
H  -3.73669 -1.621383 0.208695
H  0.381338 -3.3718 -1.430217
H  0.625604 -3.47425 0.36003
H  2.03513 -3.183137 -0.732111
H  2.453188 0.076755 2.425199
