program: Gaussian 09
title: 000265108
version: EM64L-G09RevD.01
frameworkgroup: C1[X(C8H16O2)]
method: RPBEPBE
basis: SDD
operation: Freq
keyword: #pfreq=noraman
keyword: PBEPBE/SDD
title: #p freq=noraman PBEPBE/SDD
converged: YES YES NO NO
title: Mulliken charges:
elementType: O O C C C C C C C C H H H H H H H H H H H H H H H H
charge: -0.448484 -0.437352 0.344500 -0.455346 -0.469864 -0.082745 -0.118198 -0.463893 -0.739279 -0.741545 0.221035 0.213489 0.194082 0.223362 0.187706 0.217163 0.207591 0.216665 0.222566 0.224172 0.183643 0.214915 0.214199 0.212595 0.332210 0.326810
chargesum: 0.00000
title: Mulliken charges with hydrogens summed into heavy atoms:
elementType: O O C C C C C C C C
charge: -0.116274 -0.110542 0.344500 -0.020821 -0.052419 0.104962 0.098965 -0.039636 -0.108897 -0.099836
polarizability: 9.83688505e+01 -1.50927189e+00 8.89135544e+01 8.49439017e-01 -3.22184721e-01 8.26007975e+01
1716.lowfreq: -19.1270 -0.0005 0.0001 0.0004 5.6206 15.9451 104.0666 125.5362 156.1754
frequency: 104.0152 125.5206 156.1391 191.7189 220.1225 242.2347 266.3130 282.5525 304.1494 311.3028 344.7132 361.8513 404.4277 413.0358 453.3721 480.1940 501.5561 649.4885 758.0521 796.0257 861.2431 874.2720 887.3082 901.4638 925.8906 941.2348 964.1316 988.0107 1008.9723 1039.1079 1062.2720 1079.7090 1123.1751 1135.0221 1172.8418 1205.9669 1226.9708 1247.1664 1266.8315 1281.7930 1298.3771 1304.3447 1327.3981 1342.3326 1360.7490 1375.2393 1383.6798 1396.7010 1399.8597 1441.4006 1447.5432 1459.9672 1464.3326 1473.3130 1479.2322 1491.4426 2932.1235 2960.9509 2966.5667 2970.9625 2980.1770 2984.2500 3035.3153 3040.8775 3042.9044 3045.9386 3049.3818 3062.7333 3067.1797 3071.6866 3548.2286 3574.0371
redmass: 3.0758 2.3949 2.7018 1.1010 1.1569 1.6661 1.6177 3.1186 2.2168 1.2006 2.7769 3.4600 2.1830 2.3254 1.9452 3.0323 3.0004 3.5286 3.4694 3.3199 1.8083 1.5958 2.3195 2.4127 1.5151 2.1369 1.9148 3.0082 1.4073 1.8854 1.7152 1.4924 1.5389 1.2057 2.1800 1.3660 1.9112 2.2243 1.6184 1.3847 1.3599 1.6019 1.3714 1.5190 1.4986 1.2282 1.1562 1.2431 1.4624 1.0869 1.0910 1.0778 1.0542 1.0688 1.0590 1.0580 1.0823 1.0378 1.0404 1.0571 1.0594 1.0606 1.0991 1.0991 1.0937 1.0934 1.1014 1.0997 1.0990 1.0994 1.0660 1.0656
irintensity: 2.9816 1.5313 10.1370 105.9374 2.8490 0.8011 3.8557 33.0631 13.0790 120.8841 0.5264 4.0847 1.0920 0.7787 0.8335 4.4842 7.4961 7.9079 4.6262 12.6348 9.1061 2.3141 14.4725 17.0353 0.1270 34.4452 5.9457 76.0371 1.6636 13.5799 28.3763 2.3328 51.7887 0.3352 10.5125 30.7443 21.2151 15.8012 1.9409 1.7806 13.4361 0.9107 12.8988 14.2152 21.1477 21.2328 22.8586 5.5858 9.2286 6.4924 6.4940 1.2080 0.9525 19.6876 9.0653 17.7016 39.6376 62.7496 13.8937 29.1310 25.6331 30.7488 19.4466 34.6469 58.4768 23.3688 54.1284 14.8794 57.3763 59.8624 2.4728 3.6731
temp: 298.150 k
press: 1.00000 atm
elementType: 8 8 6 6 6 6 6 6 6 6 1 1 1 1 1 1 1 1 1 1 1 1 1 1 1 1
symmnumber: 1
zpe: 600162.9 jmol-1
zpe.correction: 0.228590 hartree
zpe.thermalcorrener: 0.239930 hartree
zpe.thermalcorrenthalpy: 0.240875 hartree
zpe.thermalcorrgfe: 0.193116 hartree
zpe.sumelectzpe: -464.054260 hartree
zpe.sumelectthermal: -464.042919 hartree
zpe.sumelectthermalent: -464.041975 hartree
zpe.sumelectthermalfe: -464.089734 hartree
dipole: 0.6529 -0.3330 0.0932
dipole: 0.7388
quadrupole: -58.2507 -76.9218 -59.5155
quadrupole: -1.4261 -0.3201 -2.1279
quadrupole: 6.6453 -12.0258 5.3805 -1.4261 -0.3201 -2.1279
hfenergy: -464.2828498 hartree
pointgroup: C01 [X(C8H16O2)]
dipole: 0.2525803 0.1388543 -0.0376497 debye
dipolederiv: -0.613025 0.3424429 0.0309719 0.3943222 -0.5209034 0.1487379 0.0410681 0.1385589 -0.5214453 -0.6156819 0.0750955 -0.0391867 0.0882678 -0.4785804 -0.2559363 -0.0618642 -0.3334187 -0.5462802 0.1189348 -0.0024854 -0.020802 -0.0488378 0.1073332 0.0096289 -0.0421165 0.0047808 0.1288872 -0.1113397 0.0135019 -0.0394337 -0.0361675 0.0329746 -0.0237918 -0.0210209 0.0120217 0.0649377 -0.0926603 -0.0861968 -0.0529959 -0.0062905 -0.001706 -0.0300072 0.0075161 -0.0640455 0.0235176 0.5633327 -0.2027154 -0.0005993 -0.1819843 0.4248256 -0.0373903 0.0126094 -0.0797067 0.3961392 0.4468971 -0.0651361 -0.0165497 -0.0820931 0.4167169 0.1548746 -0.0080834 0.2698376 0.5327642 -0.0862636 0.1124329 0.0395581 0.1419086 -0.1600438 0.0398537 -0.0483755 0.0590298 -0.0012204 0.0646976 0.0282595 0.0158345 0.0214644 0.019059 -0.0212942 0.0670531 0.0061657 -0.0802996 -0.0194205 -0.0448312 -0.0303128 -0.0443184 0.0372694 -0.026373 -0.0285286 -0.0260204 0.037283 0.0475797 -0.0548728 0.0365194 -0.0450102 -0.0846103 0.1000361 0.0188783 0.131187 -0.003833 0.0478149 0.0183036 0.0250073 0.0036767 0.0550209 -0.0535058 0.0259541 -0.1012183 -0.1239075 0.0693863 -0.0299207 0.0166225 -0.0336123 0.0345147 -0.0906899 0.0031464 -0.0415126 -0.163872 -0.1010477 0.1201797 -0.0031804 0.1037151 -0.046552 0.0215075 0.0336794 -0.0084781 0.0847242 -0.0039708 0.0160638 0.0231917 0.0298398 -0.0523991 -0.0858708 0.0513475 -0.0807095 -0.2021747 0.0212945 -0.0311999 0.0302352 -0.0264175 -0.1018089 0.1027105 0.0305848 0.0812954 -0.0810404 0.0873967 0.0130335 0.0145816 0.0347355 0.0209724 -0.0908942 0.0467066 -0.0437693 -0.1157406 -0.150539 -0.0920234 -0.0394424 -0.0922907 0.0139983 -0.0004715 -0.0871509 -0.00645 0.0601045 0.0450737 -0.0692622 0.0656285 -0.0981941 -0.0815163 0.1375229 0.0350651 0.0617336 0.0184327 -0.0536759 0.1242769 0.0284304 0.1387688 -0.0300274 -0.0337286 -0.0191339 0.0133225 0.0730147 -0.1086099 -0.1155907 -0.1323156 -0.1046965 0.0236964 -0.0752711 -0.1263797 -0.07982 0.0011741 0.0591057 -0.0380363 0.001965 -0.0917977 -0.1003855 0.0896327 0.0432232 0.1345483 0.0109955 0.0654706 0.0160926 0.0750513 -0.0066381 0.0695607 -0.0543709 0.0142599 -0.0799287 -0.150418 -0.1146771 0.0849 -0.0177161 0.1580101 -0.0088272 0.0029126 -0.0006803 -0.0148872 0.0862902 0.0824241 -0.1114304 -0.0514133 -0.19647 0.1996211 -0.0786645 -0.0434851 -0.0783548 0.3369504 0.3515029 -0.0208815 0.0403503 -0.0198902 0.2117969 0.1508429 0.0557271 0.1258383 0.1350166 unknown
polarizability: 98.2709715|1.8218423|89.0040749|-0.6818725|-0.5312294|82.608156 unknown
InChI: InChI=1S/C8H16O2/c1-8(2)4-6(9)3-7(10)5-8/h6-7,9-10H,3-5H2,1-2H3
charge 0 multiplicity 1
26 atoms
O  -2.342615 1.667708 -0.237997
O  -0.42361 -2.481162 -0.547993
C  1.243277 0.348088 0.030381
C  0.020057 1.314275 0.04364
C  0.919237 -0.905387 0.905833
C  -1.296933 0.62789 -0.346723
C  -0.441579 -1.593878 0.639957
C  -1.599482 -0.566456 0.579426
C  1.623453 -0.035159 -1.430174
C  2.463775 1.076022 0.654851
H  0.20008 2.170301 -0.634149
H  -0.111376 1.729022 1.063373
H  0.921364 -0.584449 1.968353
H  1.722517 -1.659706 0.798425
H  -1.248692 0.277456 -1.402287
H  -0.64527 -2.309916 1.45544
H  -1.779492 -0.165702 1.597146
H  -2.518106 -1.094627 0.257193
H  2.010016 0.85121 -1.967451
H  2.410039 -0.812142 -1.443077
H  0.76635 -0.407545 -2.02456
H  2.7110 1.993055 0.087256
H  2.258342 1.370578 1.701105
H  3.358807 0.424968 0.654017
H  -3.221613 1.257801 -0.444349
H  -0.130147 -1.963446 -1.338635
