program: Gaussian 09
title: 000265094
version: EM64L-G09RevD.01
frameworkgroup: C1[X(C7H13ClO)]
method: RPBEPBE
basis: SDD
operation: Freq
keyword: #p
keyword: freq=noraman
keyword: PBEPBE/SDD
title: #p freq=noraman PBEPBE/SDD
converged: NO YES NO NO
title: Mulliken charges:
elementType: Cl O C C C C C C C H H H H H H H H H H H H H
charge: -0.091634 -0.466935 0.007204 -0.074740 -0.420454 -0.445523 -0.401682 -0.394041 -0.665273 0.242321 0.183666 0.231687 0.188464 0.186439 0.218280 0.199182 0.205404 0.195609 0.207313 0.311621 0.245722 0.337367
chargesum: 0.00000
title: Mulliken charges with hydrogens summed into heavy atoms:
elementType: Cl O C C C C C C C
charge: -0.091634 -0.129568 0.249525 0.108926 -0.000302 -0.040803 0.002905 0.008882 -0.107930
polarizability: 1.00352238e+02 5.21998564e+00 8.58166197e+01 2.68980567e+00 1.48317015e+00 6.70085020e+01
1716.lowfreq: -20.6375 -8.7216 -0.0027 -0.0024 -0.0015 21.1150 70.7410 101.8329 148.7583
frequency: 70.5795 101.8163 148.7316 187.4310 235.6304 293.4876 308.5602 349.5678 390.0808 397.4020 430.9854 501.4292 537.4755 674.0091 776.5229 814.3013 839.3997 871.4782 899.3254 924.6525 958.8485 1003.9563 1046.8835 1050.1073 1073.0496 1093.0481 1104.6508 1132.6092 1154.8305 1180.5853 1234.3949 1247.3404 1257.1865 1267.3105 1300.8601 1308.6680 1321.5685 1332.5975 1340.0431 1345.1328 1351.1652 1389.6328 1452.7778 1463.2920 1463.7181 1468.8375 1475.2262 2914.5022 2963.2490 2965.4846 2974.2375 2975.6615 2999.2378 3028.5335 3038.3175 3046.5606 3050.0664 3055.7472 3153.2309 3558.1084
redmass: 3.8536 3.5771 3.7468 2.4126 6.1175 1.1047 1.6637 2.2027 3.7462 3.9621 3.3523 2.8872 1.9126 5.8779 2.0777 1.5954 1.9208 2.1192 1.6211 1.6913 1.9710 4.0763 1.6717 1.6107 1.2858 2.3395 1.7529 1.7323 1.5851 1.4544 1.3031 1.2429 1.2994 1.2037 1.3070 1.2350 1.2411 1.3537 1.4012 1.5257 1.5470 1.5907 1.0953 1.0906 1.0904 1.0834 1.0948 1.0826 1.0669 1.0607 1.0657 1.0608 1.0828 1.0995 1.0971 1.1000 1.0636 1.0950 1.1067 1.0661
irintensity: 0.6114 0.8615 3.2208 1.3604 3.6185 134.1361 3.7078 13.2780 12.5689 6.5641 0.9911 3.1968 7.2755 45.3829 0.8407 4.5854 10.8929 6.3996 3.5438 19.1312 13.1541 81.0608 3.7152 0.4372 2.9013 3.0103 1.7450 8.7554 21.8062 6.0651 13.1420 0.8756 4.7908 8.0445 5.9331 6.8257 10.3067 3.4681 0.6007 3.2430 3.0278 4.9007 11.0826 10.2388 5.1392 20.4947 3.2869 45.3346 33.0454 26.8684 35.4672 38.7898 19.9568 37.4112 50.7976 51.9313 9.4603 75.6750 6.1811 2.7840
temp: 298.150 k
press: 1.00000 atm
elementType: 17 8 6 6 6 6 6 6 6 1 1 1 1 1 1 1 1 1 1 1 1 1
symmnumber: 1
zpe: 498209.5 jmol-1
zpe.correction: 0.189758 hartree
zpe.thermalcorrener: 0.199333 hartree
zpe.thermalcorrenthalpy: 0.200277 hartree
zpe.thermalcorrgfe: 0.154760 hartree
zpe.sumelectzpe: -809.090967 hartree
zpe.sumelectthermal: -809.081392 hartree
zpe.sumelectthermalent: -809.080448 hartree
zpe.sumelectthermalfe: -809.125965 hartree
dipole: 4.0730 0.3418 1.2275
dipole: 4.2677
quadrupole: -67.2626 -61.1617 -61.7876
quadrupole: 2.0469 -0.7473 2.0184
quadrupole: -3.8586 2.2423 1.6164 2.0469 -0.7473 2.0184
hfenergy: -809.2807252 hartree
pointgroup: C01 [X(C7H13Cl1O1)]
dipole: 1.5706465 0.2320225 0.5462433 debye
dipolederiv: -0.6011544 -0.1312861 -0.0631159 -0.2135548 -0.2943197 -0.0506984 -0.1267287 -0.0591596 -0.2286501 -0.347527 0.2115917 0.1253125 0.2040525 -0.8606926 0.0702637 0.1447152 0.1005671 -0.4876455 -0.119196 -0.0577173 0.0092819 -0.0880915 -0.0664433 -0.0337405 -0.0319728 -0.0679209 0.0542668 0.2745694 -0.0789167 -0.0316248 0.0170421 0.7059782 -0.0674785 0.0324728 -0.0173329 0.4189144 -0.0327538 -0.0107649 0.0218054 -0.0060855 0.0323482 -0.0061753 0.0173291 -0.0335372 0.1585812 -0.0413392 0.1359107 0.0371882 0.0026321 -0.0596503 0.0280929 0.0049241 0.0139604 0.0973791 0.0515068 0.0083993 0.0086719 0.019771 0.0635673 -0.0195247 -0.0169431 0.0231823 0.1481638 0.0667846 0.0001823 -0.0185042 -0.0343407 0.0592405 -0.0057765 0.0272232 -0.0338036 0.1569186 0.6638163 0.2489116 0.133803 0.2866031 0.2369749 0.0869159 0.1246357 0.0796567 0.2689338 0.0573835 -0.0088091 0.0253197 0.0283187 0.0513984 0.003086 0.0146575 0.0191192 -0.127234 0.0073923 0.0166182 0.0013162 0.0049014 -0.0309319 0.0363926 -0.0110509 0.0348033 -0.235059 -0.0193862 -0.1196999 -0.0322288 -0.0903617 -0.0226971 -0.0260297 -0.0424465 -0.0474957 0.0637728 0.0549275 0.0322288 0.002652 0.0297713 0.0504324 -0.0296868 0.0275653 0.0366055 -0.1883694 -0.0956208 -0.1205213 -0.0381076 -0.1357495 -0.1144313 -0.0475867 -0.0462099 -0.0808938 0.0513023 0.0536661 0.0248728 -0.036156 0.0181261 0.0604797 0.0060374 0.0253541 0.0365411 -0.1514366 0.0232083 -0.017135 -0.0130301 -0.0234955 0.0822363 0.0252243 0.0114225 -0.0436268 -0.18524 0.0109014 0.0601608 -0.0116886 0.0729531 -0.1949323 0.0461032 -0.0209202 0.077504 0.0641746 0.082994 -0.0191772 0.0075285 -0.0145045 0.0224918 -0.0009366 -0.067501 0.0216861 -0.1911312 -0.1945839 0.0631986 0.0648307 0.0589471 0.02062 -0.0143423 0.0998196 -0.0234034 0.0542901 0.0196713 0.0125427 -0.0378167 0.0381285 -0.0422083 -0.0039415 -0.0562324 0.007737 0.0770031 -0.0015113 -0.0479772 -0.0616317 -0.0641732 0.0595977 0.0117456 0.0100136 -0.0206672 -0.1321758 0.0862511 -0.2026126 -0.0938055 -0.1108901 0.2409414 -0.007944 -0.1201273 -0.0235218 0.3132408 unknown
polarizability: 99.3162012|6.0211944|86.5023229|3.9065139|2.4459915|67.3588357 unknown
InChI: InChI=1S/C7H13ClO/c8-5-6-3-1-2-4-7(6)9/h6-7,9H,1-5H2
charge 0 multiplicity 1
22 atoms
Cl -3.343354 -0.612874 -0.341284
O  0.062211 2.378298 -0.140758
C  -0.586887 0.039841 -0.160761
C  0.488749 1.041652 0.325091
C  -0.191724 -1.398146 0.260673
C  1.885736 0.670323 -0.214692
C  1.210486 -1.784369 -0.26429
C  2.281799 -0.767908 0.196968
C  -1.956842 0.472261 0.372556
H  -0.608706 0.100851 -1.267797
H  0.520439 1.028943 1.440458
H  -0.95505 -2.103594 -0.114376
H  -0.204608 -1.470686 1.369153
H  2.63554 1.39718 0.161339
H  1.867146 0.757118 -1.319375
H  1.18986 -1.81726 -1.372806
H  1.475432 -2.801172 0.082607
H  2.385533 -0.821655 1.300381
H  3.269988 -1.021302 -0.231084
H  -2.20764 1.49625 0.067674
H  -2.040075 0.353558 1.465335
H  0.784065 3.029287 0.051588
