program: Gaussian 09
title: 000265091
version: EM64L-G09RevD.01
frameworkgroup: C1[X(C7H10O2)]
method: RPBEPBE
basis: SDD
operation: Freq
keyword: #pfreq=noraman
keyword: PBEPBE/SDD
title: #p freq=noraman PBEPBE/SDD
converged: NO NO NO NO
title: Mulliken charges:
elementType: O O C C C C C C C H H H H H H H H H H
charge: -0.272919 -0.225508 -0.152178 -0.143477 -0.179124 -0.124503 -0.038657 -0.479540 -0.746916 0.252174 0.248508 0.255339 0.255008 0.220264 0.243514 0.215162 0.216211 0.217688 0.238952
chargesum: 0.00000
title: Mulliken charges with hydrogens summed into heavy atoms:
elementType: O O C C C C C C C
charge: -0.272919 -0.225508 0.099996 0.105032 0.076215 0.130506 0.181608 -0.020864 -0.074064
polarizability: 8.08319835e+01 -2.12162494e+00 7.41685016e+01 1.50269496e-02 2.59672675e-01 6.19526189e+01
1716.lowfreq: -26.3697 -11.1556 -0.0004 -0.0003 0.0006 13.9750 120.1497 242.1381 259.4587
frequency: 120.1245 242.1353 259.4563 296.9633 344.1752 417.4242 440.3446 587.6435 630.9212 740.5589 761.6507 768.4603 818.9157 826.6955 841.3492 870.0507 897.8147 917.9674 941.0948 955.8140 963.5946 974.1406 1016.1334 1046.1059 1079.0427 1095.4451 1161.8106 1174.9482 1191.2975 1201.0053 1216.7832 1244.0102 1254.3412 1273.3982 1276.1386 1323.1725 1344.1624 1387.3582 1461.1574 1473.9600 1481.8629 2973.9775 2993.6984 3014.7099 3066.8319 3076.7387 3082.5648 3120.0510 3129.0541 3137.9051 3157.4949
redmass: 2.8411 1.5192 1.7115 2.7868 3.6413 2.4250 7.6418 5.8293 3.7371 4.3207 5.3370 4.9361 2.5593 3.2585 2.6026 3.1404 1.9585 1.8698 2.3189 3.9181 1.6373 2.2411 1.2626 1.8603 1.5090 1.8121 1.4178 1.4208 1.2694 1.4656 1.3149 1.4999 1.5143 1.6276 1.4335 1.6471 2.5308 1.2081 1.0899 1.0432 1.0513 1.0358 1.0821 1.0626 1.0997 1.1020 1.1023 1.0895 1.0921 1.0879 1.1012
irintensity: 1.2792 1.2185 1.0171 1.3093 0.8078 1.6556 2.2657 17.6482 9.5942 3.4219 13.3566 1.1594 37.5279 16.3619 2.9659 10.1311 3.5150 7.0480 18.8496 15.9299 4.2111 4.4653 7.1124 0.6255 10.4275 0.5748 6.1277 4.4642 2.2770 2.7490 1.6716 1.1055 1.7176 1.5254 3.9601 3.6110 3.8549 14.1196 11.2608 10.7869 6.0592 33.9755 21.8850 32.7373 29.0932 15.9185 40.2159 23.7904 13.7320 21.2899 13.2173
temp: 298.150 k
press: 1.00000 atm
elementType: 8 8 6 6 6 6 6 6 6 1 1 1 1 1 1 1 1 1 1
symmnumber: 1
zpe: 413145.0 jmol-1
zpe.correction: 0.157359 hartree
zpe.thermalcorrener: 0.164653 hartree
zpe.thermalcorrenthalpy: 0.165598 hartree
zpe.thermalcorrgfe: 0.125993 hartree
zpe.sumelectzpe: -422.417095 hartree
zpe.sumelectthermal: -422.409800 hartree
zpe.sumelectthermalent: -422.408856 hartree
zpe.sumelectthermalfe: -422.448460 hartree
dipole: 2.5123 0.9377 -3.2023
dipole: 4.1768
quadrupole: -59.8590 -48.2479 -55.5129
quadrupole: -3.5353 3.1103 0.9596
quadrupole: -5.3191 6.2920 -0.9729 -3.5353 3.1103 0.9596
hfenergy: -422.5744532 hartree
pointgroup: C01 [X(C7H10O2)]
dipole: -1.0185772 -0.323194 -1.2483684 debye
dipolederiv: -0.7972741 -0.1396977 -0.0486435 -0.1495081 -0.2627551 -0.0204862 -0.1292663 -0.0407357 -0.352666 -0.5088797 0.0152571 0.0049044 0.0086107 -0.4894981 -0.0015404 -0.0149263 0.0036678 -0.4953276 0.3263906 0.0191137 -0.0002606 0.0686821 0.0377646 -0.0438989 -0.0323262 -0.0652154 0.1599363 0.2883959 0.119956 -0.0312778 0.0665704 0.083882 0.0548431 -0.0579118 0.0705355 0.1522512 0.2365641 -0.0073184 0.0129064 -0.0057208 0.3210751 0.0332 0.0360407 -0.0061078 0.2355014 0.3117923 -0.0294404 0.0372416 -0.0241366 0.3264139 -0.0395849 0.0324139 -0.0098064 0.2696345 0.0515238 -0.039522 -0.0535472 -0.0666336 0.0189909 -0.0776466 0.0292598 -0.0261955 0.1169904 -0.10423 0.0377031 -0.1013002 0.0834266 -0.0343425 0.030484 -0.0375357 0.0164752 0.0683992 -0.0392656 0.0081604 0.060663 -0.0060595 0.0741432 0.0029783 -0.0042356 0.0020185 0.0312467 0.0335916 0.0134805 0.0207296 0.0147798 0.0463107 0.0974381 0.0218476 0.1195145 -0.0241451 0.044362 -0.0036364 0.0698601 -0.0025367 0.0159102 -0.0789439 0.0832559 -0.1007614 -0.0080309 0.0540307 0.0498247 0.0199923 0.0390998 -0.0696592 -0.0500017 0.0338658 -0.0887308 0.0350273 0.0437176 0.0381379 -0.0183953 0.0358329 -0.0535343 0.063159 -0.0304146 0.1080011 0.023169 0.024929 0.0075644 0.030022 0.0110903 0.0252003 0.0680186 0.0085509 0.0825044 -0.1601838 -0.0704344 -0.1183854 0.0507863 -0.074538 0.009763 0.0286642 0.0676569 0.0678725 0.03419 0.0649686 0.0313785 0.032092 0.0158445 0.0217727 -0.0726914 0.017013 -0.1245529 -0.1137712 0.0401136 0.0473086 0.0071595 0.1118431 -0.1626151 0.0092241 0.0152724 0.0157081 0.0968943 -0.0900099 -0.0605388 -0.0603055 -0.1196091 0.0219133 -0.0706152 -0.0843769 -0.0692222 0.034765 0.089714 0.0106541 -0.0326269 -0.0070377 0.0692643 0.0674001 0.0458166 0.0450305 -0.1038809 unknown
polarizability: 80.7147583|-2.2849022|74.2835526|-0.3769903|-0.0156307|61.9547931 unknown
InChI: InChI=1S/C7H10O2/c1-3-2-4-6-7(9-6)5(3)8-4/h3-7H,2H2,1H3
charge 0 multiplicity 1
19 atoms
O  2.316059 0.473186 0.091083
O  0.077594 -0.082169 1.321035
C  1.045097 0.870099 -0.623167
C  1.441275 -0.572356 -0.557545
C  -0.208149 0.941297 0.276247
C  0.37655 -1.194438 0.374785
C  -1.363818 0.266647 -0.545172
C  -0.936267 -1.257069 -0.470463
C  -2.751184 0.526995 0.069688
H  1.157745 1.513845 -1.501164
H  1.884525 -1.142311 -1.380209
H  -0.437869 1.897123 0.76477
H  0.657518 -2.086973 0.94764
H  -1.348737 0.621906 -1.59439
H  -1.703669 -1.847954 0.057771
H  -0.779812 -1.701415 -1.470329
H  -3.029344 1.59583 0.004648
H  -3.532102 -0.057961 -0.451004
H  -2.757112 0.23342 1.135378
