program: Gaussian 09
title: 000265206
version: EM64L-G09RevD.01
frameworkgroup: C1[X(C20H19NO4S)]
method: RPBEPBE
basis: SDD
operation: Freq
keyword: #p
keyword: freq=noraman
keyword: PBEPBE/SDD
title: #p freq=noraman PBEPBE/SDD
converged: YES YES NO NO
title: Mulliken charges:
elementType: S O O O O N C C C C C C C C C C C C C C C C C C C C H H H H H H H H H H H H H H H H H H H
charge: 0.779127 -0.200181 -0.258805 -0.631226 -0.626472 -0.130444 -0.382411 0.400221 -0.342364 0.413082 0.331228 -0.402455 -0.349065 -0.389290 -0.385938 0.277007 -0.238528 -0.239051 0.453133 -0.328036 -0.317262 -0.242651 -0.406594 -0.312184 -0.797760 -0.529091 0.297984 0.237127 0.243439 0.232030 0.243238 0.406687 0.224190 0.225396 0.330884 0.274272 0.251367 0.241039 0.228619 0.238380 0.235988 0.243132 0.230403 0.220389 0.251448
chargesum: 0.00000
title: Mulliken charges with hydrogens summed into heavy atoms:
elementType: S O O O O N C C C C C C C C C C C C C C C C C C C C
charge: 0.779127 -0.200181 -0.258805 -0.224539 -0.626472 -0.130444 -0.382411 0.400221 -0.044380 0.413082 0.331228 -0.165328 -0.105626 -0.157260 -0.142701 0.277007 -0.014338 -0.013656 0.453133 0.002847 -0.042990 -0.014032 -0.155227 -0.071145 -0.080260 0.173149
polarizability: 3.32659187e+02 7.99609070e+00 3.67770492e+02 -2.28703028e+01 3.14351937e+01 1.58467052e+02
1716.lowfreq: -4.0392 0.0011 0.0017 0.0018 2.6281 3.5505 10.5209 14.5817 28.7520
frequency: 10.2409 14.5273 28.7465 32.9968 46.7270 50.4827 57.0768 65.8209 73.1272 81.8867 93.7662 99.5379 110.1028 134.0965 143.0647 186.7270 208.1472 219.8056 227.1803 235.6382 248.7428 276.9543 292.5172 323.6445 342.0150 345.7522 351.1181 399.3221 405.6779 407.5967 413.7234 420.4150 463.6973 496.8107 498.2625 543.6645 563.0519 575.0417 607.1360 608.1979 617.7043 629.7607 666.7953 699.7128 701.0270 714.9705 739.7920 760.9461 771.4778 807.6099 815.9080 819.9673 829.2127 841.0834 847.6653 860.3899 875.1049 915.5504 943.5237 954.8913 972.1848 983.5644 984.3219 988.8764 992.3907 994.3390 1000.0584 1004.4468 1017.1590 1026.6910 1043.6497 1045.1451 1085.8503 1112.2173 1120.5206 1144.9817 1165.8044 1170.3388 1173.2989 1195.3954 1206.7761 1225.6048 1235.7977 1255.1579 1294.9531 1309.9485 1311.5887 1325.8966 1338.0079 1350.5321 1376.0338 1385.8304 1398.5692 1421.9818 1428.5797 1433.0837 1438.6947 1464.4933 1466.6465 1468.8588 1470.3806 1474.2955 1488.4467 1506.0675 1559.9655 1566.2514 1586.7739 1610.5530 1612.8711 1622.6917 2760.4835 2967.5308 2979.3946 3055.4884 3059.9605 3070.2510 3098.5811 3116.7957 3122.5132 3127.9835 3130.4133 3134.3434 3137.6896 3141.4506 3149.2810 3149.6487 3163.6253 3164.1129 3165.3599
redmass: 5.6537 5.1637 2.0319 1.5643 3.7201 4.2674 5.5438 6.0167 7.0410 6.4500 7.4790 5.0992 5.0528 5.2773 4.2510 4.0869 3.8929 3.5012 5.7775 1.6196 5.5381 6.3700 6.9962 7.9037 3.9015 3.5805 4.9348 6.8618 2.8336 5.8093 3.2403 6.3457 3.7689 3.6359 2.7117 4.9901 11.8434 6.0256 6.3008 3.8645 5.6196 6.6004 7.3885 5.8276 1.7179 3.2422 3.2748 4.6186 1.9582 6.8911 3.0119 1.5742 4.0148 1.5573 1.2567 1.3966 1.3436 1.4079 1.4847 1.3573 1.4202 7.2061 1.5727 5.2793 1.3208 1.3279 2.2246 6.5064 1.3879 2.5985 1.6179 1.9309 1.6154 1.2567 1.4518 1.4039 1.3181 2.2475 1.0583 1.1454 1.4387 3.0914 1.8323 2.0934 2.4772 1.6176 1.1756 1.2360 6.8119 2.5152 8.6512 2.7775 1.4646 5.1018 3.8754 1.2384 2.2961 1.0533 1.3625 1.1282 1.1363 1.3668 2.3286 2.9408 6.6296 5.3953 6.2741 5.9703 6.0207 7.1976 1.0753 1.0328 1.0384 1.0961 1.1042 1.0981 1.0987 1.0904 1.0845 1.0872 1.0892 1.0990 1.0894 1.0913 1.0963 1.0933 1.0953 1.0959 1.1007
irintensity: 2.1347 0.8640 2.2078 1.3625 1.8025 1.2025 2.5997 3.0370 4.3726 2.0780 1.0426 0.1537 2.9086 5.2794 1.4741 9.4710 4.0798 21.3666 2.1490 13.0700 0.8952 1.5885 16.6268 6.8062 15.3633 6.4448 1.5627 30.2610 0.0366 0.6086 2.1553 15.4257 10.5160 10.1416 21.9385 20.1638 35.8061 30.3466 0.2109 0.7913 0.4049 4.0060 0.5592 0.5115 49.9407 1.8648 5.0713 10.0679 76.1669 14.4819 13.5149 30.8199 88.1655 46.1422 0.2661 15.3516 93.3755 5.9827 5.7670 6.3636 1.2834 36.6868 5.6344 1.2334 0.2008 3.6459 5.4021 31.6985 10.2588 13.6413 16.0411 12.3556 5.9291 0.2774 42.6027 24.0660 20.8961 156.2477 1.0050 4.2083 7.7540 2.1807 73.9476 156.3790 8.9946 7.9039 18.4031 7.3468 190.7172 13.6697 5.2504 14.5895 14.0736 6.3365 32.0818 29.5277 5.7142 14.5841 157.6222 37.6923 26.7720 14.9092 8.5994 31.6524 6.3767 10.7278 2.6800 129.7617 22.0958 31.0121 2715.1118 74.9818 10.7694 13.6160 39.3059 261.8828 17.2539 13.7676 6.3992 1.7708 12.6389 24.5141 9.0969 9.5848 36.1464 12.0213 7.6852 23.0999 20.9334
temp: 298.150 k
press: 1.00000 atm
elementType: 16 8 8 8 8 7 6 6 6 6 6 6 6 6 6 6 6 6 6 6 6 6 6 6 6 6 1 1 1 1 1 1 1 1 1 1 1 1 1 1 1 1 1 1 1
symmnumber: 1
zpe: 891622.3 jmol-1
zpe.correction: 0.339601 hartree
zpe.thermalcorrener: 0.365556 hartree
zpe.thermalcorrenthalpy: 0.366501 hartree
zpe.thermalcorrgfe: 0.278576 hartree
zpe.sumelectzpe: -1525.215953 hartree
zpe.sumelectthermal: -1525.189998 hartree
zpe.sumelectthermalent: -1525.189054 hartree
zpe.sumelectthermalfe: -1525.276979 hartree
dipole: 0.7842 -1.4486 -0.1874
dipole: 1.6579
quadrupole: -111.8635 -130.8658 -164.4910
quadrupole: -30.3518 -7.0522 -1.0443
quadrupole: 23.8767 4.8743 -28.7509 -30.3518 -7.0522 -1.0443
hfenergy: -1525.5555544 hartree
pointgroup: C01 [X(C20H19N1O4S1)]
dipole: 0.2310741 0.5092869 -0.3356689 debye
polarizability: 329.9304267|12.6171016|306.0648994|36.0652667|-97.582684|222.9014053 unknown
InChI: InChI=1S/C13H12O3S.C7H7NO/c1-16-12-8-7-11(9-13(12)17(14)15)10-5-3-2-4-6-10;1-6-2-4-7(8-9)5-3-6/h2-9,14H,1H3;2-5H,1H3
charge 0 multiplicity 1
45 atoms
S  0.796292 -0.272601 2.243919
O  5.084726 -2.008537 1.134588
O  -0.71471 -2.606589 3.379544
O  1.569691 -1.54517 1.166527
O  0.927085 1.172094 1.440949
N  4.251534 -1.050222 0.922608
C  -0.95155 -0.824752 1.806801
C  -2.957057 -0.455547 0.461625
C  -1.643802 -0.076854 0.853758
C  -1.506137 -1.969537 2.424645
C  -3.714744 0.327104 -0.554936
C  -3.513344 -1.610558 1.074169
C  -2.81275 -2.36182 2.040434
C  -4.665773 -0.301795 -1.406284
C  -3.50943 1.727442 -0.701526
C  4.765807 0.131593 0.290231
C  -5.388833 0.44105 -2.363456
C  -4.229255 2.470671 -1.660675
C  5.640094 2.523769 -0.944905
C  3.848315 1.206977 0.119139
C  6.119368 0.242104 -0.14963
C  -5.175345 1.832745 -2.49629
C  4.300933 2.39314 -0.491722
C  6.540849 1.427119 -0.761678
C  6.117477 3.791876 -1.619875
C  -1.209907 -3.861562 3.953407
H  -1.122865 0.784385 0.415285
H  -4.534424 -1.914485 0.818318
H  -3.289422 -3.235411 2.494786
H  -4.817143 -1.385502 -1.34389
H  -2.799727 2.242272 -0.044249
H  2.59436 -1.368183 1.164214
H  -6.109797 -0.067633 -3.013469
H  -4.057883 3.549327 -1.750136
H  2.810658 1.12551 0.476218
H  6.795247 -0.606236 0.000701
H  3.603686 3.228175 -0.61925
H  7.576287 1.525214 -1.109118
H  -5.734961 2.409993 -3.240583
H  7.03237 4.182314 -1.136542
H  5.350134 4.582698 -1.59502
H  6.373417 3.600748 -2.679922
H  -1.385275 -4.614721 3.162291
H  -2.139166 -3.697243 4.532399
H  -0.408632 -4.203655 4.623592
