program: Gaussian 09
title: 000265077
version: EM64L-G09RevD.01
frameworkgroup: C1[X(C14H15N3O2)]
method: RPBEPBE
basis: SDD
operation: Freq
keyword: #p
keyword: freq=noraman
keyword: PBEPBE/SDD
title: #p freq=noraman PBEPBE/SDD
converged: YES YES NO NO
title: Mulliken charges:
elementType: O O N N N C C C C C C C C C C C C C C H H H H H H H H H H H H H H H
charge: -0.200575 -0.209583 -0.116497 -0.399918 -0.003643 -0.441366 0.253375 -0.497021 -0.298661 0.053505 0.452735 0.119420 -0.039611 -0.449779 -0.368833 -0.778641 -0.217602 -0.228454 -0.242328 0.219112 0.258217 0.203612 0.228577 0.206682 0.235316 0.316401 0.232846 0.273167 0.287014 0.229962 0.231373 0.228127 0.231539 0.231534
chargesum: 0.00000
title: Mulliken charges with hydrogens summed into heavy atoms:
elementType: O O N N N C C C C C C C C C C C C C C
charge: -0.200575 -0.209583 -0.116497 -0.083517 -0.003643 0.035963 0.253375 -0.064833 0.143336 0.053505 0.452735 0.119420 -0.039611 -0.216933 -0.095666 -0.030292 0.010525 0.003084 -0.010794
polarizability: 2.08455209e+02 1.57492798e+01 1.71788006e+02 -2.22191378e+01 -4.02881228e+00 1.42725382e+02
1716.lowfreq: -10.5457 -3.2699 -0.0005 -0.0003 0.0002 4.4570 12.0171 26.8821 31.6468
frequency: 11.2286 26.8638 31.6425 36.4581 79.8984 95.6273 149.7661 172.8857 184.6835 196.2816 220.7189 276.6760 301.9951 315.4091 338.2326 376.7794 406.2439 419.4024 444.9932 476.9472 508.8996 524.1685 546.9884 582.7303 596.8952 609.2935 613.2422 616.5524 671.1898 706.7109 736.8928 749.7500 762.4149 801.6471 858.3928 863.1369 904.5080 917.9891 947.5186 969.1445 977.4006 986.0503 989.3233 991.4105 1005.2800 1024.5622 1044.7105 1046.0416 1077.4562 1081.6891 1103.2335 1141.4675 1171.7104 1179.6467 1181.9941 1195.0160 1204.5582 1210.3782 1247.6224 1277.0153 1291.2536 1305.7529 1322.6218 1344.6702 1371.9293 1383.3751 1391.1801 1397.4746 1441.0796 1441.5129 1456.7054 1465.2316 1471.0448 1475.7094 1479.5752 1482.7761 1571.4393 1595.5089 1600.2494 1613.4275 1628.7436 2818.4241 2870.2300 2881.9726 2983.3111 2997.9029 2999.2550 3061.7232 3106.5868 3112.4959 3125.7661 3136.9238 3138.6841 3147.7613 3163.8431 3527.2996
redmass: 5.8330 1.4574 2.1574 3.7713 4.5367 5.7814 3.9451 3.5529 3.3785 4.2534 5.2038 3.2106 2.5089 2.6205 5.2173 4.3650 2.8824 3.9424 5.1286 3.7860 7.0902 6.1007 6.0832 1.2625 5.0589 3.4148 5.6933 5.9719 5.3499 2.1159 5.7241 1.5946 10.5645 3.9998 3.4610 1.3416 5.5394 1.4634 5.0891 1.8812 1.9761 1.4140 3.5772 1.9915 1.3722 2.1832 1.5613 1.9144 2.5941 2.1706 4.6418 2.1406 1.0617 1.4596 1.1890 1.4181 2.6829 2.5840 1.5463 2.3019 1.5610 1.7104 1.9594 1.4295 1.7439 3.3600 1.2831 1.8268 1.5249 2.0403 1.1054 1.1235 1.0454 1.1742 2.0026 2.0020 4.8079 6.1284 8.5720 6.0740 6.5764 1.0710 1.0697 1.0710 1.0396 1.0853 1.0873 1.0981 1.0932 1.0878 1.0860 1.0910 1.0965 1.0959 1.1014 1.0783
irintensity: 5.3458 0.9105 1.5179 0.1145 0.5250 0.8201 1.1887 3.1399 1.9830 5.3082 1.4188 5.0481 0.8142 5.3705 1.1465 5.4854 0.1402 7.8876 0.3135 10.3952 7.4582 1.7478 9.2939 76.0420 2.3270 7.0187 0.4097 0.6099 3.2786 39.4597 1.2209 58.5516 2.5390 15.4604 29.3972 2.5056 60.9308 5.4307 51.8325 43.9652 7.0912 0.6296 0.4328 1.8409 0.7097 14.9953 4.6486 11.7730 88.8059 34.2413 24.2192 88.9819 0.4293 5.2537 5.0180 7.9850 72.7128 45.8283 17.7580 27.2549 17.7249 4.4807 19.1562 14.5740 18.0994 23.0966 31.6199 9.3685 60.2571 14.9642 1.7005 11.8232 20.2659 16.3327 22.0762 8.2959 392.4425 0.7298 78.0366 6.0552 158.2462 74.5287 42.6590 179.0188 18.8714 4.6728 22.8703 17.0963 20.1356 9.3748 0.0567 10.8932 2.3997 31.0237 24.4782 30.8093
temp: 298.150 k
press: 1.00000 atm
elementType: 8 8 7 7 7 6 6 6 6 6 6 6 6 6 6 6 6 6 6 1 1 1 1 1 1 1 1 1 1 1 1 1 1 1
symmnumber: 1
zpe: 704545.5 jmol-1
zpe.correction: 0.268347 hartree
zpe.thermalcorrener: 0.285216 hartree
zpe.thermalcorrenthalpy: 0.286161 hartree
zpe.thermalcorrgfe: 0.220440 hartree
zpe.sumelectzpe: -855.788865 hartree
zpe.sumelectthermal: -855.771996 hartree
zpe.sumelectthermalent: -855.771052 hartree
zpe.sumelectthermalfe: -855.836773 hartree
dipole: 7.0073 4.8582 -6.0711
dipole: 10.4673
quadrupole: -135.8313 -102.6445 -108.4657
quadrupole: -16.8632 14.0762 5.9338
quadrupole: -20.1841 13.0027 7.1815 -16.8632 14.0762 5.9338
hfenergy: -856.0572127 hartree
pointgroup: C01 [X(C14H15N3O2)]
dipole: -2.6028522 2.1647133 2.3448373 debye
polarizability: 205.1828245|-17.8953101|171.7101253|-25.3484354|1.2502643|146.0756467 unknown
InChI: InChI=1S/C14H15N3O2/c1-10-15-12-8-17(7-11-5-3-2-4-6-11)9-19-13(12)14(18)16-10/h2-6,15H,7-9H2,1H3
charge 0 multiplicity 1
34 atoms
O  1.401986 -2.104427 -0.228863
O  3.811729 -1.639342 -1.603519
N  -0.60655 -1.112734 0.68562
N  2.021448 1.496796 0.308056
N  3.849312 0.622859 -0.95337
C  -0.002597 0.190354 1.003297
C  1.362066 0.259853 0.34577
C  -1.986246 -1.325767 1.154923
C  0.339542 -2.209213 0.805479
C  1.968113 -0.825274 -0.263347
C  -2.992938 -0.405724 0.463418
C  3.252559 1.629564 -0.334478
C  3.258585 -0.684491 -0.992305
C  -4.070263 0.154663 1.191408
C  -2.885057 -0.138374 -0.924793
C  3.890164 3.000091 -0.296876
C  -5.033291 0.963014 0.543399
C  -3.842765 0.672088 -1.572844
C  -4.921909 1.223758 -0.841508
H  0.082995 0.36921 2.108369
H  -0.658479 0.985794 0.597546
H  -2.082634 -1.199654 2.261446
H  -2.243747 -2.380808 0.93323
H  0.874136 -2.230245 1.786919
H  -0.158743 -3.171809 0.619643
H  1.58774 2.311734 0.747219
H  -4.15888 -0.04193 2.267709
H  -2.042195 -0.566338 -1.479822
H  4.849603 2.947335 -0.829588
H  4.078986 3.334683 0.740628
H  3.253949 3.758469 -0.791314
H  -5.863728 1.389711 1.117145
H  -3.751051 0.870643 -2.646704
H  -5.665943 1.85071 -1.345494
