program: Gaussian 09
title: 000265076
version: EM64L-G09RevD.01
frameworkgroup: C1[X(C9H13N4OP)]
method: RPBEPBE
basis: SDD
operation: Freq
keyword: #p
keyword: freq=noraman
keyword: PBEPBE/SDD
title: #p freq=noraman PBEPBE/SDD
converged: YES YES NO NO
title: Mulliken charges:
elementType: P O N N N N C C C C C C C C C H H H H H H H H H H H H H
charge: 1.193452 -0.625724 -0.382272 -0.409937 -0.777835 -0.077176 -0.381942 -0.396944 -0.373271 -0.398097 0.222573 -0.316589 -0.176270 -0.333960 -0.195717 0.254449 0.257516 0.264202 0.252099 0.253188 0.246253 0.269703 0.255513 0.369322 0.305456 0.235018 0.237179 0.229812
chargesum: 0.00000
title: Mulliken charges with hydrogens summed into heavy atoms:
elementType: P O N N N N C C C C C C C C C
charge: 1.193452 -0.625724 -0.382272 -0.409937 -0.408514 -0.077176 0.130022 0.119358 0.126170 0.127120 0.222573 -0.011132 0.058747 -0.096782 0.034095
polarizability: 2.03844156e+02 2.21713740e+00 1.22303636e+02 2.52006983e+00 6.62661747e+00 1.21416124e+02
1716.lowfreq: -5.3006 -0.0012 -0.0007 -0.0002 4.0623 12.7413 13.3958 44.6833 48.9271
frequency: 12.9774 44.6569 48.8880 58.5666 96.6850 124.4692 139.5986 178.7454 181.7774 220.0661 253.7203 275.2043 302.6381 340.3831 387.1953 410.3033 446.2249 499.8960 544.6253 579.6325 598.0713 630.3380 662.6882 749.8977 761.1752 784.5313 785.2768 801.9006 809.0067 812.2845 881.7973 892.0477 897.3867 904.4972 951.9675 954.6268 993.8907 999.1467 999.7857 1000.7372 1044.4742 1070.5926 1078.9140 1085.8083 1113.5176 1120.9160 1123.6551 1125.6354 1150.7986 1154.4771 1168.8228 1233.3028 1236.3323 1244.4890 1308.1951 1333.7747 1382.2124 1429.0295 1448.7129 1450.2983 1463.3999 1466.3596 1470.2004 1566.0287 1591.2825 3074.7972 3077.0758 3081.6207 3083.7629 3130.6223 3139.9240 3158.7340 3174.0723 3185.2286 3186.7892 3201.8141 3203.7749 3514.5227
redmass: 4.3107 4.1679 3.4515 3.1235 4.4782 2.7769 4.4845 5.8147 4.8921 4.3264 5.6204 6.1699 3.7862 4.5931 5.4631 3.5714 5.8998 2.2692 7.8935 5.4305 4.5557 6.3447 1.8513 1.9930 6.3192 2.7893 3.7376 7.1182 1.1318 1.1295 4.1724 4.0198 1.3908 4.4776 1.4475 6.5286 1.0723 1.2014 1.2312 6.1213 2.3285 1.2605 1.2641 1.6362 1.3166 1.3176 1.2859 1.3026 1.3913 1.3858 1.0980 2.8149 1.9643 2.9382 1.7882 5.1262 1.7088 2.1996 1.0776 1.0754 1.1818 1.3804 1.8262 5.5786 5.7885 1.0496 1.0493 1.0604 1.0611 1.0882 1.0900 1.0958 1.1010 1.1176 1.1177 1.1175 1.1175 1.0745
irintensity: 1.1566 0.0045 2.8772 0.4452 1.8247 2.1129 1.0310 25.9112 23.2330 0.7438 0.6333 0.5452 0.3614 0.3688 8.3956 2.3579 39.5378 26.0917 79.5252 12.6700 13.9956 20.3487 162.8815 8.1985 27.8512 64.5673 28.5723 20.6999 36.0694 18.5282 143.4506 113.1466 31.1455 180.2401 3.0558 20.5850 2.5355 6.3193 6.2209 52.0284 10.4468 2.5014 9.8017 8.7906 4.8860 5.8026 8.5210 11.5015 0.0098 0.5031 1.8724 50.4894 20.4598 46.0591 108.9147 18.8682 144.6111 57.3250 5.8787 8.2558 12.3410 121.9617 223.4533 20.4216 272.4883 8.8327 17.3545 29.3633 19.0760 13.1715 18.9718 1.3273 32.6764 0.4810 1.4425 10.4367 12.4170 61.2177
temp: 298.150 k
press: 1.00000 atm
elementType: 15 8 7 7 7 7 6 6 6 6 6 6 6 6 6 1 1 1 1 1 1 1 1 1 1 1 1 1
symmnumber: 1
zpe: 568772.1 jmol-1
zpe.correction: 0.216634 hartree
zpe.thermalcorrener: 0.231736 hartree
zpe.thermalcorrenthalpy: 0.232680 hartree
zpe.thermalcorrgfe: 0.172002 hartree
zpe.sumelectzpe: -984.984804 hartree
zpe.sumelectthermal: -984.969702 hartree
zpe.sumelectthermalent: -984.968758 hartree
zpe.sumelectthermalfe: -985.029436 hartree
dipole: -1.5707 0.8603 0.8102
dipole: 1.9656
quadrupole: -78.0967 -87.7579 -103.4306
quadrupole: 2.4747 2.6398 -0.3518
quadrupole: 11.6650 2.0038 -13.6689 2.4747 2.6398 -0.3518
hfenergy: -985.2014375 hartree
pointgroup: C01 [X(C9H13N4O1P1)]
dipole: -0.6780009 -0.0207307 -0.3713801 debye
polarizability: 198.3192134|-18.373902|121.089514|-9.4902118|6.730139|128.1551884 unknown
InChI: InChI=1S/C9H13N4OP/c14-15(12-5-6-12,13-7-8-13)11-9-3-1-2-4-10-9/h1-4,11H,5-8H2
charge 0 multiplicity 1
28 atoms
P  -1.244852 0.432078 0.09129
O  -1.145019 0.981244 -1.419953
N  -2.208528 -1.062274 0.31759
N  -1.96808 1.487386 1.329477
N  0.278583 0.092509 0.850905
N  2.492628 -0.524715 1.161617
C  -1.99295 -2.174172 -0.696716
C  -3.27559 -1.367648 -0.724904
C  -3.264556 2.201929 1.00279
C  -1.963155 2.981001 1.059638
C  1.537919 -0.137905 0.261463
C  1.800921 0.025403 -1.129034
C  3.105963 -0.24624 -1.583267
C  3.748503 -0.772442 0.69267
C  4.10659 -0.656979 -0.667632
H  -1.980164 -3.173652 -0.253011
H  -1.280488 -2.004996 -1.513868
H  -3.396819 -0.660861 -1.555754
H  -4.195297 -1.782997 -0.303108
H  -3.968891 2.24333 1.838331
H  -3.709877 2.049986 0.011537
H  -1.542443 3.324554 0.106343
H  -1.7241 3.586062 1.938486
H  0.27511 -0.021384 1.870412
H  1.011575 0.372722 -1.80201
H  3.342185 -0.129392 -2.646673
H  4.482939 -1.07493 1.447964
H  5.128193 -0.872515 -0.993484
