program: Gaussian 09
title: 000265070
version: EM64L-G09RevD.01
frameworkgroup: C1[X(C20H19N)]
method: RPBEPBE
basis: SDD
operation: Freq
keyword: #pfreq=noraman
keyword: PBEPBE/SDD
title: #p freq=noraman PBEPBE/SDD
converged: YES YES NO NO
title: Mulliken charges:
elementType: N C C C C C C C C C C C C C C C C C C C C H H H H H H H H H H H H H H H H H H H
charge: -0.148196 0.103126 0.336950 0.355912 -0.433465 -0.441456 -0.385628 -0.431699 -0.346010 0.398458 0.534477 -0.252940 -0.241913 -0.357334 -0.370635 -0.196952 -0.415921 -0.427149 -0.347597 -0.646809 -0.645122 0.229372 0.245125 0.227933 0.240253 0.223865 0.219680 0.237148 0.237908 0.219823 0.221724 0.226017 0.219246 0.222653 0.237495 0.219284 0.238100 0.218996 0.237820 0.237457
chargesum: 0.00000
title: Mulliken charges with hydrogens summed into heavy atoms:
elementType: N C C C C C C C C C C C C C C C C C C C C
charge: -0.148196 0.103126 0.336950 0.355912 -0.204093 -0.196331 -0.157695 -0.191446 -0.122144 0.398458 0.534477 -0.033259 -0.022089 -0.120186 -0.132727 0.022295 -0.194197 -0.201132 -0.124944 0.048070 0.049151
polarizability: 7.72008268e+02 1.48030802e+01 2.23201632e+02 3.03008005e-01 4.03885442e-02 9.56413550e+01
1716.lowfreq: -7.1362 -4.9557 -0.0009 -0.0005 0.0004 1.6677 22.2992 26.8057 33.9550
frequency: 21.9648 26.7337 33.9151 63.3882 71.6557 104.1488 110.1644 130.0963 170.3973 182.2487 193.3864 195.9475 238.0802 244.5527 281.0100 305.6482 338.6967 377.0778 403.4179 420.8930 429.7851 437.4936 473.6020 490.7520 524.5446 539.1972 566.8510 575.9252 610.6901 636.1981 655.0955 697.6067 729.2614 736.8284 747.5634 759.3104 777.9987 801.8607 802.5246 819.3004 851.9350 859.3552 874.5840 880.2939 911.8690 921.6725 940.8298 941.1639 947.0762 957.3442 974.8672 983.4812 993.1079 1008.9823 1018.9902 1054.6519 1072.0997 1104.6118 1109.4477 1110.8933 1130.1261 1164.2372 1165.8010 1187.2673 1194.5496 1203.2377 1220.6706 1250.5895 1257.5107 1260.7110 1299.2422 1306.9122 1319.2180 1332.9786 1365.2747 1369.8979 1386.3840 1412.0623 1428.7731 1444.2115 1449.7551 1455.6848 1458.7640 1463.2189 1475.9642 1490.8450 1503.4707 1504.9156 1528.1993 1548.4463 1586.7342 1599.2057 1606.3642 1615.8653 1639.5233 2943.3565 2950.6047 3010.6752 3013.7335 3075.8205 3081.8338 3098.3682 3108.5092 3114.4331 3116.3783 3118.3148 3123.6064 3134.8957 3137.5861 3157.0964 3163.2549 3167.6556 3168.1788 3197.3166
redmass: 4.2677 3.7066 4.8246 4.0604 2.3581 1.8429 5.1326 2.3848 5.1741 1.9330 1.4103 2.7492 3.8488 2.1891 3.3612 4.4474 3.5394 3.7740 3.2272 2.8517 3.9620 3.2601 3.7628 3.6840 2.1654 5.1120 3.2085 4.8405 5.7057 6.7723 2.5982 5.0125 5.3072 2.8705 2.4326 1.3194 5.1297 1.8178 1.2935 1.7088 4.9397 4.4334 1.4712 1.7316 1.5910 1.3645 1.4440 3.0980 1.3845 1.3588 1.3270 1.1692 2.8937 3.4410 2.0184 1.5056 1.6374 1.2403 1.3227 1.3642 1.5765 1.6869 1.1115 1.9388 1.8393 1.2449 2.0583 1.4405 2.7994 1.6785 1.4935 1.9871 1.8268 1.5129 2.7903 3.6180 3.2328 2.9236 1.2237 2.8841 2.5815 2.8994 1.4393 1.0404 1.0458 1.1135 1.1431 4.5292 2.6130 5.9305 6.6525 4.6427 7.2311 6.8769 6.2171 1.0367 1.0392 1.0996 1.1028 1.0892 1.0889 1.0964 1.0943 1.0859 1.0891 1.0887 1.0885 1.0874 1.0943 1.1001 1.0932 1.0943 1.0886 1.1043
irintensity: 0.8290 0.1148 0.4412 0.3113 0.1932 4.8583 0.1130 0.2500 0.2796 0.0964 0.0869 2.7473 0.4636 0.3173 3.4891 3.4206 6.6956 1.8057 1.6143 4.4016 0.2156 5.8188 8.2203 15.3475 12.9368 14.3052 3.7513 0.9665 1.1510 0.2077 1.5161 18.0329 2.8642 4.4386 18.1233 98.0579 6.3595 25.3906 0.1254 73.7724 18.2004 0.3847 6.2972 0.0084 1.5182 0.9060 4.8285 44.6288 4.6706 0.0276 2.9201 64.5685 0.2260 74.0476 4.5906 24.7294 18.8573 0.0427 1.0495 25.2295 2.9362 17.6713 26.2233 190.7489 2.7387 73.0215 5.0115 4.7856 32.4871 34.3522 16.9733 5.8752 75.0501 6.7729 205.5112 234.5352 4.7661 8.2139 14.7173 200.6796 63.8679 223.7648 13.3106 0.3688 22.7238 0.9248 77.9497 76.3927 242.6910 3.1889 70.6960 875.1557 273.8075 0.4810 119.5276 101.3667 253.0178 7.1183 76.3742 10.1683 14.6233 4.1093 55.9125 4.8985 9.7602 29.9682 0.7412 4.8514 36.6469 79.0362 28.6082 27.4942 2.1490 18.0718
temp: 298.150 k
press: 1.00000 atm
elementType: 7 6 6 6 6 6 6 6 6 6 6 6 6 6 6 6 6 6 6 6 6 1 1 1 1 1 1 1 1 1 1 1 1 1 1 1 1 1 1 1
symmnumber: 1
zpe: 859823.7 jmol-1
zpe.correction: 0.327490 hartree
zpe.thermalcorrener: 0.346377 hartree
zpe.thermalcorrenthalpy: 0.347322 hartree
zpe.thermalcorrgfe: 0.278393 hartree
zpe.sumelectzpe: -826.787985 hartree
zpe.sumelectthermal: -826.769097 hartree
zpe.sumelectthermalent: -826.768153 hartree
zpe.sumelectthermalfe: -826.837082 hartree
dipole: -7.8450 0.1623 0.0319
dipole: 7.8467
quadrupole: -83.9957 -108.0095 -135.1786
quadrupole: -3.4712 -0.1381 0.0134
quadrupole: 25.0656 1.0518 -26.1173 -3.4712 -0.1381 0.0134
hfenergy: -827.1154747 hartree
pointgroup: C01 [X(C20H19N1)]
dipole: 3.0860546 0.0749156 -0.0322652 debye
polarizability: 772.0321408|-12.8530922|221.936796|-6.8367338|12.2844515|96.8823184 unknown
InChI: InChI=1S/C20H19N/c1-21(2)19-14-10-16(11-15-19)6-5-8-18-13-12-17-7-3-4-9-20(17)18/h3-15H,1-2H3
charge 0 multiplicity 1
40 atoms
N  6.488845 0.331486 -0.034487
C  -4.109698 -0.184808 0.01514
C  -4.960801 0.970139 0.132564
C  -2.705619 0.285862 0.055912
C  -2.769911 1.750235 0.200672
C  -4.095036 2.154242 0.24747
C  -4.670784 -1.470668 -0.110669
C  -6.363931 0.831193 0.122658
C  -1.57204 -0.514004 -0.028815
C  5.124423 0.038249 -0.043604
C  2.289318 -0.559706 -0.065636
C  -6.08287 -1.605739 -0.11999
C  -6.920256 -0.46695 -0.004683
C  4.138977 1.077427 0.063483
C  4.650295 -1.309175 -0.161822
C  -0.208936 -0.057899 0.006323
C  2.771007 0.780792 0.051919
C  3.276106 -1.586258 -0.170889
C  0.876414 -0.913462 -0.085325
C  6.94498 1.722606 0.091947
C  7.475624 -0.749714 -0.16088
H  -1.900293 2.407242 0.262237
H  -4.454913 3.180767 0.351218
H  -4.036801 -2.361102 -0.200913
H  -7.017064 1.707053 0.211376
H  -1.718501 -1.600071 -0.134176
H  -6.532986 -2.600298 -0.21744
H  4.450104 2.121872 0.154083
H  5.357923 -2.138334 -0.246548
H  -8.008939 -0.594441 -0.014258
H  2.058026 1.608761 0.134271
H  2.946186 -2.629098 -0.262534
H  -0.039596 1.021642 0.109727
H  0.658872 -1.988533 -0.186723
H  6.583827 2.352451 -0.746072
H  8.045734 1.748949 0.084814
H  6.600069 2.182946 1.039717
H  8.490673 -0.323262 -0.144057
H  7.354965 -1.305708 -1.112491
H  7.397707 -1.477286 0.672383
