program: Gaussian 09
title: 000265066
version: EM64L-G09RevD.01
frameworkgroup: C1[X(C13H7F2NO)]
method: RPBEPBE
basis: SDD
operation: Freq
keyword: #p
keyword: freq=noraman
keyword: PBEPBE/SDD
title: #p freq=noraman PBEPBE/SDD
converged: YES YES NO YES
title: Mulliken charges:
elementType: F F O N C C C C C C C C C C C C C H H H H H H H
charge: -0.200831 -0.168901 -0.139381 -0.694625 0.314028 0.138160 0.236626 0.030058 -0.243159 -0.379465 -0.623254 0.183471 0.185469 0.541592 -0.427359 -0.320166 -0.354786 0.269344 0.274083 0.224791 0.259123 0.263744 0.313332 0.318108
chargesum: 0.00000
title: Mulliken charges with hydrogens summed into heavy atoms:
elementType: F F O N C C C C C C C C C C C C C
charge: -0.200831 -0.168901 -0.139381 -0.063184 0.314028 0.138160 0.236626 0.030058 -0.243159 -0.110121 -0.349171 0.183471 0.185469 0.541592 -0.202569 -0.061043 -0.091042
polarizability: 2.79395529e+02 8.47530198e+00 1.66656913e+02 2.52808093e-03 -1.25135860e-02 5.71707464e+01
1716.lowfreq: -6.9718 -0.0008 -0.0007 0.0003 1.6668 9.1010 65.4481 93.2354 134.1556
frequency: 65.4432 93.2333 134.1495 136.9865 146.7707 201.0664 236.7253 259.0911 332.1272 337.9968 367.8575 370.0232 398.9155 419.2603 420.7752 422.2284 458.6064 474.9044 524.7242 557.5256 566.6122 596.9552 611.9056 669.4401 686.0805 700.0561 757.0174 799.2868 799.3721 819.4589 833.2142 844.7857 910.9637 915.4628 924.7036 958.8545 965.5446 1028.6958 1088.4619 1103.1115 1146.1911 1174.9216 1190.8441 1205.0811 1243.8517 1280.2244 1327.7590 1351.1569 1375.9637 1429.4169 1461.5965 1480.2434 1503.3050 1585.8908 1600.0658 1608.0314 1637.1796 1642.8616 1648.7703 3129.0623 3135.3247 3166.9546 3170.2871 3190.5559 3560.1414 3699.6626
redmass: 7.5831 5.5776 7.7901 7.5357 7.1456 5.3042 10.8142 9.0283 5.7848 8.0656 6.1025 4.3836 1.0707 8.4875 2.7997 1.2611 8.6075 4.7944 5.7160 6.5598 4.1561 3.6377 6.3195 7.7353 4.2084 7.6119 5.6019 8.4411 1.6148 3.3791 1.5039 8.5038 1.8915 4.0842 1.3437 1.3769 4.2213 1.5645 1.9698 2.7000 1.3991 2.1140 3.0234 3.4201 1.8311 2.3951 2.6443 4.4185 8.2262 3.6850 3.8560 6.0176 4.2822 8.1032 7.9621 9.4569 3.6499 5.8526 1.5989 1.0894 1.0924 1.0955 1.0888 1.0975 1.0452 1.1040
irintensity: 5.7530 0.2967 2.0486 1.2908 0.7488 0.8617 0.7263 3.6294 1.3883 0.1049 0.7167 4.3811 0.1568 1.8377 8.9086 318.4138 1.2902 1.9417 1.7682 0.3163 0.0079 11.4291 4.9840 13.6032 0.9120 6.1357 0.8453 24.3050 32.3438 41.0342 44.1367 43.8595 20.2773 6.7681 0.0733 0.3937 18.5624 5.3634 14.3519 20.8354 13.1433 12.0281 80.5616 59.3356 6.5710 20.7122 94.1334 11.1912 0.0016 41.2383 93.1828 138.8024 120.1583 75.5468 51.6016 214.0454 47.8778 143.6242 292.5963 17.4394 11.8688 6.6160 1.8119 0.7784 143.7010 24.9828
temp: 298.150 k
press: 1.00000 atm
elementType: 9 9 8 7 6 6 6 6 6 6 6 6 6 6 6 6 6 1 1 1 1 1 1 1
symmnumber: 1
zpe: 435941.6 jmol-1
zpe.correction: 0.166041 hartree
zpe.thermalcorrener: 0.179255 hartree
zpe.thermalcorrenthalpy: 0.180199 hartree
zpe.thermalcorrgfe: 0.126665 hartree
zpe.sumelectzpe: -828.104808 hartree
zpe.sumelectthermal: -828.091595 hartree
zpe.sumelectthermalent: -828.090651 hartree
zpe.sumelectthermalfe: -828.144184 hartree
dipole: -4.0611 3.0520 0.0015
dipole: 5.0801
quadrupole: -56.6204 -106.7229 -99.2411
quadrupole: 7.9473 -0.0124 0.0040
quadrupole: 30.9077 -19.1947 -11.7130 7.9473 -0.0124 0.0040
hfenergy: -828.2708494 hartree
pointgroup: C01 [X(C13H7F2N1O1)]
dipole: 1.5989247 1.1992162 -0.000598 debye
dipolederiv: -0.1465571 -0.2384403 -0.0000558 0.0728027 -0.9653809 -0.0001752 -0.0000026 -0.0001329 -0.1325728 -0.4429573 -0.2719942 -0.0000788 -0.5997277 -0.7683014 -0.0001906 -0.0001291 -0.000103 -0.1257889 -0.4518912 0.0137386 0.0000031 -0.0304398 -1.0220456 -0.0002101 -0.0000029 -0.0001324 -0.2907462 -1.9084493 0.3217056 -0.0001877 0.3979752 -0.1510905 -0.0000856 0.0014842 -0.0003146 -0.7297919 -0.5793301 0.1153292 0.0000469 0.0335034 -0.1686019 0.0000312 -0.0000413 0.0000311 -0.0456163 1.0149978 -0.1097451 0.0000251 -0.1896458 -0.0361117 0.0000084 -0.0001598 -0.0000085 0.009606 -0.2310352 -0.4440954 -0.0000483 -0.3008356 -0.0805109 -0.0000503 -0.0000603 -0.0001637 0.046567 -0.8240239 0.1462213 -0.0000024 -0.0012531 -0.2976337 -0.0000603 0.00009 -0.00004 -0.0031348 1.1578839 0.0324365 0.0000812 -0.0544629 1.2472069 0.0003062 -0.0000246 0.0003548 0.1391191 0.398898 -0.0279164 0.0000026 0.0486039 0.1235093 -0.0001429 0.0003114 0.0000282 -0.1003996 -0.5175133 0.2503765 0.00015 -0.4690752 0.1262696 0.0000038 0.0001016 -0.0000099 -0.1867923 -0.4995304 0.3916793 0.0000435 0.2047731 1.0108929 0.0002124 0.0001009 0.0001473 0.0486536 0.6717228 0.215656 0.0000501 0.7500578 0.9474997 0.0002318 0.0001431 0.0000943 0.1179787 1.9543004 -0.349961 -0.0006598 -0.3852609 0.0063854 0.0002196 -0.0022909 0.0004658 0.1488008 -0.3829907 0.0597269 0.0001472 0.6598056 -0.0553534 -0.0001081 0.0000825 -0.0000916 -0.2229822 0.3719929 -0.1711872 0.0000015 0.1952924 -0.0423237 0.0000337 0.0000431 0.0000278 -0.1104814 -0.1724649 0.0866637 0.0000356 -0.3026735 -0.1928278 -0.0000178 -0.0000448 0.0000182 -0.1898905 0.1003593 0.055088 -0.000011 0.0196746 -0.0294915 0.0000437 -0.0001702 -0.000039 0.154618 0.0474576 0.0374773 -0.0000337 0.0694235 -0.0225576 -0.0000093 0.0000599 -0.0001179 0.1698186 -0.0782462 -0.1069608 -0.000014 -0.1007469 0.0000263 0.0000402 0.0000753 0.0000643 0.1670258 0.0490003 0.0636268 0.0000104 0.074296 0.0192448 -0.0000286 -0.0000074 -0.0000386 0.172643 -0.0239083 -0.0229571 -0.0000174 -0.026456 0.0945851 -0.0000264 -0.0000002 -0.0000224 0.1863772 0.2631851 -0.0071802 0.0002455 0.0507204 0.1101982 -0.0000451 0.0001816 -0.0000005 0.3886281 0.2290998 -0.039288 0.0002662 -0.1163513 0.1464124 0.0000196 0.0002603 -0.0000168 0.388361 unknown
polarizability: 279.3791771|-8.5833525|166.6732651|0.0025401|0.0125112|57.1707464 unknown
InChI: InChI=1S/C13H7F2NO/c14-9-3-4-10(15)12-11(9)7-2-1-6(16)5-8(7)13(12)17/h1-5H,16H2
charge 0 multiplicity 1
24 atoms
F  -1.221749 3.041938 0.000729
F  -3.140082 -2.220928 -0.000499
O  -0.087376 -2.891238 -0.000386
N  4.827127 -0.401891 -0.000561
C  0.717906 0.627944 0.000164
C  -0.756662 0.657282 0.000343
C  1.135746 -0.735094 0.000264
C  -1.254271 -0.688917 -0.000067
C  -0.075837 -1.632221 -0.000194
C  1.688634 1.648082 0.000077
C  2.481522 -1.105681 0.000717
C  -1.682189 1.706634 0.000501
C  -2.635034 -0.916067 -0.000243
C  3.474482 -0.073913 0.001151
C  3.056341 1.292982 0.00044
C  -3.074762 1.476692 0.000361
C  -3.562268 0.152522 0.000022
H  1.396499 2.702258 -0.00014
H  2.761657 -2.165518 0.000582
H  3.818109 2.081921 0.000234
H  -3.761041 2.328233 0.000498
H  -4.634711 -0.05773 -0.000091
H  5.540948 0.321388 -0.001261
H  5.12861 -1.372377 -0.000937
