program: Gaussian 09
title: 000265062
version: EM64L-G09RevD.01
frameworkgroup: C1[X(C13H7F2NO)]
method: RPBEPBE
basis: SDD
operation: Freq
keyword: #p
keyword: freq=noraman
keyword: PBEPBE/SDD
title: #p freq=noraman PBEPBE/SDD
converged: NO NO NO YES
title: Mulliken charges:
elementType: F F O N C C C C C C C C C C C C C H H H H H H H
charge: -0.204801 -0.199613 -0.151518 -0.698742 0.056916 0.356433 0.272857 0.226453 -0.303510 0.265626 -0.673156 -0.384297 -0.560738 0.609761 -0.594334 -0.359826 0.339236 0.277182 0.276164 0.302422 0.249906 0.258415 0.317241 0.321922
chargesum: 0.00000
title: Mulliken charges with hydrogens summed into heavy atoms:
elementType: F F O N C C C C C C C C C C C C C
charge: -0.204801 -0.199613 -0.151518 -0.059579 0.056916 0.356433 0.272857 0.226453 -0.303510 0.265626 -0.395974 -0.108133 -0.258316 0.609761 -0.344428 -0.101411 0.339236
polarizability: 2.74672719e+02 1.07105940e+01 1.64260510e+02 -1.68874257e-02 -2.30145541e-03 5.71625224e+01
1716.lowfreq: -0.0008 -0.0004 -0.0001 3.1491 5.1441 10.9337 57.2915 98.1172 133.5028
frequency: 57.2862 98.1168 133.5027 145.0525 170.6873 228.8931 241.4637 260.2376 266.0792 336.9973 350.6542 390.4572 391.3239 406.5192 423.8208 429.1274 486.7756 491.1625 527.2105 555.9067 560.7770 601.2622 618.9199 662.3522 679.0748 689.3355 752.2363 771.8860 815.4886 837.1900 849.5332 893.2208 894.8901 923.9479 957.0318 965.2608 980.3485 1024.9086 1051.2444 1082.3890 1125.1173 1140.7714 1189.2710 1206.4195 1247.9055 1267.4444 1333.5678 1369.0682 1391.8552 1440.3082 1456.3326 1485.8681 1502.6775 1594.9664 1602.2145 1610.2240 1629.1661 1645.0950 1653.9261 3143.0920 3157.9098 3161.2034 3170.5117 3179.5054 3562.6214 3702.4654
redmass: 8.0306 7.0019 8.3666 7.1988 6.1014 4.8508 11.9984 5.5820 6.1892 10.0152 5.6872 1.2757 2.7615 5.1449 3.7810 1.2645 4.2858 7.7324 8.5366 6.6447 3.9759 5.7086 4.0667 7.3668 3.1203 6.1492 4.1864 7.6802 3.1212 1.4094 1.7478 5.8786 1.5200 2.0620 1.3767 4.1384 5.7659 2.6543 1.5859 2.3674 1.5430 2.5844 2.4202 1.9902 2.1812 1.7758 3.8914 9.6676 3.4320 4.5531 3.2245 7.1815 5.1883 8.3889 9.3605 7.9362 7.6004 1.3792 4.5149 1.0925 1.0921 1.0891 1.0937 1.0973 1.0452 1.1042
irintensity: 3.4979 2.4392 1.5376 0.0085 2.8677 0.3400 4.8269 0.3255 0.2793 0.9329 6.0244 0.1267 4.3444 0.3601 0.5979 321.4139 3.8077 8.7133 10.9614 3.5894 5.0290 3.6279 0.8574 0.5665 3.7564 12.6562 5.2659 48.2131 25.5063 29.1494 52.1868 14.3678 0.6277 45.2864 1.3337 14.9680 6.5986 7.2018 4.4048 20.2037 25.1635 43.9275 77.7580 4.6082 77.7189 11.3501 79.7149 6.1292 22.5627 17.2248 216.2566 115.2190 119.6541 31.2500 69.5441 139.4241 79.9956 71.3324 328.3724 6.1000 6.3323 3.5378 1.5488 3.8585 146.1192 27.2775
temp: 298.150 k
press: 1.00000 atm
elementType: 9 9 8 7 6 6 6 6 6 6 6 6 6 6 6 6 6 1 1 1 1 1 1 1
symmnumber: 1
zpe: 436470.0 jmol-1
zpe.correction: 0.166243 hartree
zpe.thermalcorrener: 0.179411 hartree
zpe.thermalcorrenthalpy: 0.180355 hartree
zpe.thermalcorrgfe: 0.126901 hartree
zpe.sumelectzpe: -828.110001 hartree
zpe.sumelectthermal: -828.096833 hartree
zpe.sumelectthermalent: -828.095889 hartree
zpe.sumelectthermalfe: -828.149343 hartree
dipole: -5.7632 1.5162 -0.0003
dipole: 5.9593
quadrupole: -71.3375 -100.6965 -99.1874
quadrupole: 8.2245 0.0023 0.0002
quadrupole: 19.0696 -10.2893 -8.7803 8.2245 0.0023 0.0002
hfenergy: -828.2762437 hartree
pointgroup: C01 [X(C13H7F2N1O1)]
dipole: -2.2664738 0.6001039 -0.0001376 debye
dipolederiv: -0.2055204 -0.1524056 0.0000006 0.0680691 -0.9821927 -0.0000163 0.0000028 0.0000055 -0.1456757 -1.4100447 0.0957378 0.0001409 0.1870919 -0.2057224 -0.0000206 0.0001631 -0.0000124 -0.1472306 -0.5102124 0.0170125 0.0000157 0.0814204 -1.0528595 0.0000424 0.0000205 0.0000091 -0.295754 -1.8699084 -0.3539904 0.000146 -0.417871 -0.1841267 0.0000532 0.0003901 0.0000919 -0.7322404 -0.477992 -0.0700967 0.0000282 -0.0651167 -0.358957 -0.0000017 0.0000012 0.0000078 -0.0932006 0.7914207 0.1583333 -0.0000562 0.0768486 -0.0172142 -0.0000115 -0.0000399 -0.0000142 0.0330512 -0.319487 0.4270762 0.0000196 0.3150373 0.0217681 -0.0000117 0.0000371 -0.0000206 0.0729907 -0.544143 -0.3388958 0.0000576 -0.0060808 -0.2093924 0.0000137 0.000052 0.0000439 0.0167661 1.2118092 0.0283075 -0.0000924 -0.0291089 1.2670164 -0.000064 -0.0001011 -0.0000388 0.1079091 0.6550959 0.1187481 -0.000032 -0.1140097 1.1410339 0.0000255 -0.0000077 0.0000005 0.1317865 -0.5133146 -0.2300166 0.0000167 0.424307 0.0906094 -0.0000403 -0.0000216 -0.0000119 -0.2065388 -0.3247316 -0.1087389 0.0000095 -0.2096418 0.0759583 0.0000215 0.0000138 0.0000191 -0.1486812 -0.0758715 0.1221813 -0.0000036 -0.2415025 0.0474338 0.0000214 0.0000086 -0.00002 -0.1144836 1.9406032 0.3816345 -0.0001202 0.4021638 0.1444068 -0.0000338 -0.0000995 -0.0000274 0.1603419 -0.4866045 -0.1251113 0.0000183 -0.5602313 -0.2283433 0.0000308 -0.0000223 0.0000106 -0.237546 -0.0103889 0.0455455 -0.0000145 0.1963561 -0.0240684 -0.0000244 -0.0000175 -0.0000125 -0.1317289 1.4238901 -0.110672 -0.0001622 -0.1797921 0.1358566 0.0000216 -0.0001816 0.0000169 0.0643067 0.0536493 -0.0348062 0.0000082 -0.065993 -0.0174621 0.0000102 0.0000058 0.0000152 0.1763217 0.0819004 0.0594912 0.0000098 0.0304562 -0.0139136 -0.000004 0.000006 -0.000008 0.1623597 0.0985754 0.0083165 0.0000095 0.0563242 0.034888 -0.0000034 0.000006 0.0000036 0.1810489 -0.0215112 0.0777166 0.0000101 0.0664606 0.0337587 0.0000004 0.0000046 -0.0000077 0.1901035 0.0157764 -0.06815 0.0000199 -0.0840817 0.0323716 0.0000115 0.0000245 0.0000111 0.1759539 0.2665038 0.0105895 -0.0000214 -0.0500092 0.1133984 0.0000137 -0.0001269 0.0000119 0.3902849 0.2305058 0.0421928 -0.0000079 0.1189036 0.155752 -0.0000342 -0.0001179 -0.0000735 0.3898548 unknown
polarizability: 274.7064343|10.5353275|164.2267944|-0.0168911|-0.0022747|57.1625224 unknown
InChI: InChI=1S/C13H7F2NO/c14-6-1-2-8-9(3-6)13(17)10-4-7(16)5-11(15)12(8)10/h1-5H,16H2
charge 0 multiplicity 1
24 atoms
F  -1.348608 2.841985 0.000395
F  4.943575 -0.169645 -0.000263
O  0.198507 -2.98593 0.000363
N  -4.781032 -0.597907 0.000561
C  -0.668249 0.510441 0.000367
C  0.809065 0.575489 0.000232
C  -1.080909 -0.856352 0.000412
C  1.311882 -0.763886 0.000197
C  0.15499 -1.72526 0.000352
C  -1.683714 1.471078 0.000409
C  -2.419319 -1.252132 0.000472
C  1.70545 1.662441 0.000125
C  2.685435 -1.047243 0.000034
C  -3.436956 -0.241308 0.00048
C  -3.048792 1.130837 0.000467
C  3.099594 1.396333 -0.000039
C  3.553626 0.063195 -0.000086
H  -2.678114 -2.316726 0.000543
H  1.344235 2.694362 0.000174
H  3.065952 -2.072795 0.000015
H  -3.796572 1.930771 0.000506
H  3.831167 2.210134 -0.000142
H  -5.512238 0.107518 0.000438
H  -5.057174 -1.5758 0.000387
