program: Gaussian 09
title: 000024707
version: EM64L-G09RevD.01
frameworkgroup: C1[X(C20H24O2)]
method: RPBEPBE
basis: SDD
operation: Freq
keyword: #pfreq=noraman
keyword: PBEPBE/SDD
title: #p freq=noraman PBEPBE/SDD
converged: YES YES NO NO
title: Mulliken charges:
elementType: O O C C C C C C C C C C C C C C C C C C C C H H H H H H H H H H H H H H H H H H H H H H H H
charge: -0.445639 -0.439069 0.316885 -0.175531 -0.085778 0.064536 -0.222207 -0.484399 -0.506484 -0.517677 -0.531766 -0.494553 -0.837310 0.319932 -0.580496 0.330643 0.233170 -0.395819 -0.546974 -0.429780 0.284424 -0.551272 0.232390 0.197599 0.211819 0.213634 0.220405 0.224676 0.223516 0.219749 0.219968 0.244231 0.241441 0.216670 0.205675 0.231406 0.230563 0.222069 0.225185 0.223774 0.345126 0.233356 0.256032 0.217577 0.286538 0.351764
chargesum: 0.00000
title: Mulliken charges with hydrogens summed into heavy atoms:
elementType: O O C C C C C C C C C C C C C C C C C C C C
charge: -0.100513 -0.087306 0.316885 0.056859 0.111821 0.064536 -0.010389 -0.050359 -0.058292 -0.077960 -0.046094 -0.072208 -0.153272 0.319932 -0.131536 0.330643 0.233170 -0.162463 -0.290942 -0.212202 0.284424 -0.264734
polarizability: 2.81311568e+02 -7.23041530e+00 2.01664959e+02 -3.85729224e+00 -2.67140399e+00 1.53817821e+02
1716.lowfreq: -8.5665 -4.7027 -0.0006 0.0004 0.0006 14.4302 40.3447 60.4204 65.1413
frequency: 40.0923 60.3948 65.0184 86.2344 108.6838 151.2794 160.5643 167.6912 180.7782 208.8783 221.8753 238.0530 246.3204 264.8495 288.3561 317.9823 325.6021 342.4195 345.6617 372.6527 383.3446 395.4028 399.8488 418.0620 435.7330 450.2978 461.4974 488.2682 508.0670 555.0097 561.5700 568.1723 587.3622 591.6674 612.1285 634.7715 656.1223 660.1822 687.8162 714.6284 719.0395 769.9810 784.0676 803.1707 804.4876 835.0501 851.5455 864.9988 886.5984 896.3577 922.3475 928.6156 934.7153 954.0447 973.0218 983.6300 1008.3060 1010.5472 1022.9022 1033.9527 1042.8982 1059.5842 1070.0522 1086.6438 1111.8562 1121.8305 1125.7517 1136.2833 1146.3873 1157.0011 1170.7774 1178.0193 1192.6953 1201.2384 1214.3111 1224.9900 1238.4015 1239.4841 1259.0288 1265.8797 1270.0604 1273.4810 1282.6350 1299.9997 1307.5278 1318.4350 1324.1781 1327.2024 1331.4513 1339.3014 1341.4169 1359.9042 1369.7016 1389.0070 1390.0544 1445.5337 1455.6403 1461.7255 1465.5584 1467.2241 1478.3405 1484.0988 1486.1710 1493.4955 1495.5778 1589.2938 1630.7351 2125.8573 2930.9957 2944.4192 2955.6372 2970.2635 2974.6720 2981.6737 2987.3083 2991.7366 2998.6398 3020.8551 3029.0227 3032.7374 3038.5505 3050.6941 3057.3997 3060.2130 3089.8349 3096.4713 3105.1802 3128.7376 3143.4009 3428.8033 3548.5345 3583.1581
redmass: 4.9884 4.5728 4.0179 2.6437 4.1979 3.1032 3.6245 3.5222 3.4566 3.1035 3.0356 1.3033 2.9332 2.6327 2.4388 2.1979 3.6348 1.1218 1.5791 2.5225 2.9594 3.6496 3.6242 3.2763 3.4145 2.8338 4.0116 4.5280 3.8923 3.7678 2.9051 4.7516 4.6868 3.5435 3.4773 1.2409 1.2465 2.7072 3.3724 3.2071 4.8005 2.0620 1.8318 1.7771 2.0717 2.3075 2.2905 1.9391 1.8572 2.2405 2.2224 1.3674 2.9033 2.3857 2.0888 2.0990 1.9756 2.6607 2.3486 2.6934 2.0699 2.1339 2.1265 2.0234 1.9357 1.9736 1.7557 2.3473 1.3552 1.7294 1.5727 1.4651 1.6444 1.7938 1.8246 1.4638 1.3678 1.4368 1.7791 1.8266 1.4861 1.4145 1.3920 1.3014 1.4032 1.4675 1.5027 1.4820 1.5916 1.3694 1.4676 1.5231 1.5348 3.8960 1.3266 2.7275 1.2005 1.0761 1.0885 1.0860 1.0797 1.0911 1.0617 2.1287 1.1924 7.1607 6.5100 6.0806 1.0816 1.0840 1.0649 1.0416 1.0593 1.0628 1.0747 1.0712 1.0623 1.0942 1.0976 1.0635 1.1012 1.1007 1.1014 1.0954 1.0962 1.1037 1.0865 1.0965 1.0918 1.1580 1.0658 1.0660
irintensity: 0.1976 0.0421 0.2772 0.9831 0.3200 0.6393 1.7219 0.1849 0.5758 1.8050 2.5874 6.6194 1.4996 7.8519 10.4380 53.3912 5.0370 139.2608 49.4436 1.3915 8.1805 38.5721 18.7712 16.9335 0.1207 5.6292 3.2950 1.9007 3.1175 1.5414 6.1821 6.7667 0.6066 7.2414 1.3334 71.0433 60.3276 5.7839 3.7001 1.9672 0.7537 4.8635 19.7028 17.1662 5.2661 10.9989 5.0733 18.4376 12.0621 75.8391 26.0816 0.3374 7.6573 3.3637 3.3779 7.1462 5.8591 38.9509 15.1397 9.3479 6.6316 11.4931 6.7229 15.1861 55.5604 34.9097 1.4408 7.3667 77.6736 5.4020 22.5034 30.6845 2.9737 7.8793 0.8403 1.1254 7.3440 10.3062 2.1345 47.2167 14.9084 22.2917 13.2252 0.4885 6.6145 10.3049 8.6310 5.1589 6.8470 1.2918 2.6838 1.5876 2.5874 21.8541 16.9578 7.1063 5.5943 5.0095 3.1470 6.3529 8.4158 15.4722 13.1001 65.7799 39.4399 24.2018 54.3700 3.1856 20.4562 33.5686 29.9318 26.7222 29.7885 29.7201 8.7807 35.3856 44.5403 35.8954 28.5218 18.4207 48.2151 48.4464 19.2920 24.2754 28.3933 27.2463 19.6265 22.9353 6.4574 73.8773 6.9109 37.9385
temp: 298.150 k
press: 1.00000 atm
elementType: 8 8 6 6 6 6 6 6 6 6 6 6 6 6 6 6 6 6 6 6 6 6 1 1 1 1 1 1 1 1 1 1 1 1 1 1 1 1 1 1 1 1 1 1 1 1
symmnumber: 1
zpe: 1018897.6 jmol-1
zpe.correction: 0.388078 hartree
zpe.thermalcorrener: 0.408070 hartree
zpe.thermalcorrenthalpy: 0.409014 hartree
zpe.thermalcorrgfe: 0.341637 hartree
zpe.sumelectzpe: -925.284834 hartree
zpe.sumelectthermal: -925.264842 hartree
zpe.sumelectthermalent: -925.263898 hartree
zpe.sumelectthermalfe: -925.331275 hartree
dipole: -0.1610 -1.8330 -0.5066
dipole: 1.9085
quadrupole: -137.4665 -122.1034 -130.5025
quadrupole: 5.4712 -8.7580 -2.6104
quadrupole: -7.4424 7.9207 -0.4784 5.4712 -8.7580 -2.6104
hfenergy: -925.6729121 hartree
pointgroup: C01 [X(C20H24O2)]
dipole: -0.0562813 -0.7306182 -0.163744 debye
polarizability: 281.4461102|-6.6303831|201.1522413|-3.493851|-5.0291051|154.1959971 unknown
InChI: InChI=1S/C20H24O2/c1-3-20(22)11-9-18-17-6-4-13-12-14(21)5-7-15(13)16(17)8-10-19(18,20)2/h1,5,7,12,16-18,21-22H,4,6,8-11H2,2H3
charge 0 multiplicity 1
46 atoms
O  4.409856 1.322828 -0.048261
O  -6.371289 -0.439815 -0.245224
C  2.247345 0.093517 -0.461585
C  1.52222 1.054738 0.542519
C  -0.031308 1.063101 0.491423
C  3.696689 0.029083 0.177616
C  -0.631302 -0.373021 0.45842
C  1.581897 -1.314192 -0.433607
C  2.076067 0.656776 1.948651
C  0.052111 -1.243558 -0.637492
C  3.460446 -0.014882 1.71271
C  -0.625199 1.920282 -0.654698
C  2.326931 0.620337 -1.913701
C  -2.153307 -0.361672 0.291105
C  -2.144478 2.099297 -0.456678
C  -2.863714 0.783268 -0.17477
C  4.526499 -1.069289 -0.348436
C  -2.888537 -1.536501 0.587797
C  -4.26686 0.717189 -0.344357
C  -4.287115 -1.605886 0.427756
C  -4.975317 -0.464056 -0.048165
C  5.23893 -1.957059 -0.822182
H  1.882921 2.079928 0.324023
H  -0.372084 1.541304 1.437261
H  -0.404892 -0.863705 1.429962
H  1.783546 -1.808948 0.538095
H  2.042116 -1.953689 -1.211104
H  1.388002 -0.046635 2.453104
H  2.1585 1.545922 2.597587
H  -0.194969 -0.844177 -1.640248
H  -0.371812 -2.265789 -0.606508
H  4.288936 0.524089 2.200921
H  3.479712 -1.056709 2.074817
H  -0.4333 1.450004 -1.636949
H  -0.133152 2.912207 -0.672886
H  3.094838 0.063975 -2.487358
H  1.37169 0.488803 -2.447962
H  2.573134 1.697242 -1.941378
H  -2.596962 2.590652 -1.33936
H  -2.315386 2.785584 0.399681
H  4.668163 1.37088 -1.004921
H  -2.353265 -2.419036 0.960601
H  -4.826982 1.58687 -0.705244
H  -4.830596 -2.52851 0.670393
H  5.861803 -2.737373 -1.218605
H  -6.770824 -1.314072 -0.011765
