program: Gaussian 09
title: 000265059
version: EM64L-G09RevD.01
frameworkgroup: C1[X(C10H13ClN2O)]
method: RPBEPBE
basis: SDD
operation: Freq
keyword: #p
keyword: freq=noraman
keyword: PBEPBE/SDD
title: #p freq=noraman PBEPBE/SDD
converged: YES YES NO NO
title: Mulliken charges:
elementType: Cl O N N C C C C C C C C C C H H H H H H H H H H H H H
charge: -0.085749 -0.303226 -0.484407 -0.413344 0.475450 0.452652 -0.446341 -0.343519 -0.327635 -0.405014 -0.352450 0.293340 -0.810681 -0.550591 0.212435 0.304672 0.244113 0.269992 0.289790 0.228604 0.227199 0.295993 0.229723 0.220874 0.229498 0.280905 0.267714
chargesum: 0.00000
title: Mulliken charges with hydrogens summed into heavy atoms:
elementType: Cl O N N C C C C C C C C C C
charge: -0.085749 -0.303226 -0.194617 -0.117351 0.475450 0.452652 -0.233906 -0.038847 0.186471 -0.176410 -0.125251 0.293340 -0.130586 -0.001971
polarizability: 2.16193089e+02 -4.56924104e-01 1.33386403e+02 -1.10015587e+01 8.71316332e+00 7.26328861e+01
1716.lowfreq: -46.7121 -5.6277 -0.0016 0.0018 0.0021 4.9995 12.9809 18.4572 43.1220
frequency: -46.3167 18.4175 42.7331 59.6222 67.2110 101.4794 119.5836 159.3153 226.3777 265.7213 293.0143 327.0027 354.0991 381.5332 405.2747 409.7964 472.1885 517.9656 538.4840 591.8716 605.3384 632.9498 702.6690 712.6519 716.3148 758.8585 816.7404 827.7187 853.8891 859.5343 937.9863 961.1953 983.7433 987.4814 990.4877 1008.8231 1042.1726 1046.8181 1127.0464 1131.3648 1168.8686 1193.5960 1211.3494 1222.8886 1237.5043 1270.2297 1298.2363 1313.3121 1362.4710 1373.2263 1397.3495 1410.7434 1439.4506 1444.9984 1469.6401 1470.0952 1484.3498 1509.4429 1517.2108 1595.9198 1629.2333 1640.6696 2973.6889 2992.8883 3050.7882 3051.2083 3065.2149 3080.0944 3102.2253 3121.7341 3136.1960 3154.0252 3192.2222 3525.2338 3544.7533
redmass: 1.0327 5.6632 4.9089 6.2040 5.6056 3.7532 5.0053 3.3912 4.9356 3.3409 4.9137 2.9242 2.5578 3.7941 1.6305 2.5905 2.5950 2.4318 4.7450 2.5912 1.5090 6.6299 10.0440 4.4315 3.0247 4.2051 1.4774 3.7594 1.2956 2.6271 1.3513 2.4317 1.7410 1.3183 1.9119 2.8481 1.9093 1.5336 1.7053 1.9006 1.4457 1.1079 1.5845 2.3888 1.4333 2.3595 1.1883 1.4068 2.2860 1.8204 1.2358 3.7788 1.1064 1.1059 1.0461 1.2026 1.5363 2.2164 2.8196 5.4137 5.6598 4.4933 1.0371 1.0597 1.0977 1.0960 1.0627 1.0986 1.0880 1.0908 1.0956 1.1121 1.0942 1.0761 1.0770
irintensity: 0.4291 0.8466 1.3590 2.5861 9.1826 6.0446 6.8841 3.4774 5.7471 0.5036 1.9757 2.6659 22.4282 9.2976 11.2622 1.5568 5.2171 64.0865 4.6906 42.9854 148.1687 4.5676 12.1097 13.7365 0.4735 0.1301 61.6301 2.8981 24.5058 17.2937 3.6181 15.6665 1.3012 4.3919 5.8429 1.8674 3.5640 11.2561 17.0118 5.3377 10.0971 0.7543 119.5110 0.5868 285.3368 10.2208 35.9059 45.5528 84.9591 37.1955 2.6056 15.5512 7.9222 36.5811 12.4477 22.3464 252.5511 98.2685 689.4158 60.0649 31.3061 125.4259 50.8459 58.0745 23.3616 6.9081 22.7443 20.9841 23.4365 23.6514 19.9126 17.0004 5.3373 6.6172 36.7220
temp: 298.150 k
press: 1.00000 atm
elementType: 17 8 7 7 6 6 6 6 6 6 6 6 6 6 1 1 1 1 1 1 1 1 1 1 1 1 1
symmnumber: 1
zpe: 566470.9 jmol-1
zpe.correction: 0.215757 hartree
zpe.thermalcorrener: 0.229454 hartree
zpe.thermalcorrenthalpy: 0.230398 hartree
zpe.thermalcorrgfe: 0.172787 hartree
zpe.sumelectzpe: -1032.636904 hartree
zpe.sumelectthermal: -1032.623208 hartree
zpe.sumelectthermalent: -1032.622264 hartree
zpe.sumelectthermalfe: -1032.679875 hartree
dipole: 0.2483 -1.6321 -0.5419
dipole: 1.7376
quadrupole: -83.2980 -87.6646 -92.5979
quadrupole: 7.6149 -2.8475 4.0465
quadrupole: 4.5555 0.1889 -4.7444 7.6149 -2.8475 4.0465
hfenergy: -1032.8526613 hartree
pointgroup: C01 [X(C10H13Cl1N2O1)]
dipole: 0.051346 0.6592166 0.1735322 debye
polarizability: 215.6857242|6.9729479|134.798854|10.0763455|5.7006762|71.7277993 unknown
InChI: InChI=1S/C10H13ClN2O/c1-8-2-4-9(5-3-8)13-10(14)12-7-6-11/h2-5,12-13H,6-7H2,1H3
charge 0 multiplicity 1
27 atoms
Cl 5.426168 1.548965 -0.512506
O  1.313156 -1.603339 0.221373
N  0.377848 0.563885 0.384926
N  2.689155 0.250779 0.584526
C  -1.007402 0.298377 0.184314
C  -3.822752 -0.070181 -0.204625
C  -1.896968 1.403906 0.22998
C  -1.530856 -1.000272 -0.056399
C  3.910923 -0.551365 0.601391
C  -3.281387 1.216759 0.03824
C  -2.918055 -1.162701 -0.246325
C  1.43991 -0.350224 0.382044
C  -5.313487 -0.277459 -0.41161
C  4.834489 -0.260856 -0.581682
H  -1.507122 2.414001 0.415397
H  -0.84982 -1.852411 -0.088359
H  4.461253 -0.404524 1.550076
H  3.590881 -1.609866 0.54833
H  0.604941 1.544357 0.564098
H  -3.948767 2.085966 0.078302
H  -3.307005 -2.172076 -0.431311
H  2.798243 1.266131 0.618625
H  -5.736248 -0.959529 0.350281
H  -5.866357 0.676026 -0.350767
H  -5.525767 -0.725816 -1.400677
H  4.323046 -0.358857 -1.54983
H  5.755081 -0.862272 -0.549213
