program: Gaussian 09
title: 000265048
version: EM64L-G09RevD.01
frameworkgroup: C1[X(C13H7Cl2NO)]
method: RPBEPBE
basis: SDD
operation: Freq
keyword: #p
keyword: freq=noraman
keyword: PBEPBE/SDD
title: #p freq=noraman PBEPBE/SDD
converged: NO NO NO NO
title: Mulliken charges:
elementType: Cl Cl O N C C C C C C C C C C C C C H H H H H H H
charge: -0.032228 -0.036010 -0.246326 -0.448287 0.336413 0.267288 0.119351 0.301781 -0.008593 -0.368144 -0.353123 -0.311171 -0.360771 -0.214538 -0.263551 -0.137139 -0.115249 0.338144 0.229451 0.226921 0.300324 0.258540 0.258170 0.258744
chargesum: 0.00000
title: Mulliken charges with hydrogens summed into heavy atoms:
elementType: Cl Cl O N C C C C C C C C C C C C C
charge: -0.032228 -0.036010 -0.246326 -0.110143 0.336413 0.267288 0.119351 0.301781 -0.008593 -0.138693 -0.126202 -0.010847 -0.102231 0.043632 -0.004806 -0.137139 -0.115249
polarizability: 3.20850866e+02 6.49436454e+00 1.73431293e+02 3.43697445e-04 -1.02326686e-02 6.15755871e+01
1716.lowfreq: -4.6739 -0.0024 -0.0023 -0.0015 4.8768 14.3211 41.4926 87.3321 102.8584
frequency: 41.4512 87.3214 102.8490 121.6412 154.6693 201.9171 224.1381 235.8649 261.2456 333.6579 353.4172 359.3328 383.3767 428.0788 443.0050 456.5915 496.7278 527.2412 557.0432 587.1748 598.6641 654.8729 657.5773 691.8497 716.2155 735.2262 738.6119 781.1295 816.6668 824.4609 835.6623 866.8898 909.2842 934.1159 946.6846 965.8438 989.8055 1074.3824 1084.2286 1099.2186 1140.0914 1154.2085 1236.7629 1250.3013 1263.1475 1278.2544 1312.6022 1359.2455 1377.3724 1394.0422 1411.0778 1451.3159 1467.5859 1500.6819 1546.6041 1586.1005 1604.1400 1614.9378 1636.4817 3144.8627 3146.2241 3153.3899 3167.7666 3170.4129 3177.1875 3515.1271
redmass: 13.4102 4.5263 9.5232 15.2257 5.8734 12.7760 7.1585 16.1892 4.8443 8.5256 4.6034 6.3607 12.6999 3.3253 7.0628 3.7323 7.7098 3.3016 7.5703 4.1406 6.0604 7.1434 2.4364 7.2098 2.3610 6.9902 2.1717 2.8481 1.4136 7.0901 1.9479 1.5650 4.7864 1.4437 1.3732 1.3502 7.2310 1.8886 2.0497 6.5158 1.7877 1.3354 1.6397 1.5004 2.5096 2.6024 1.9270 2.1440 7.1581 6.6813 5.2937 2.5378 3.5444 3.1457 7.9053 7.2432 6.8455 7.1712 5.6069 1.0923 1.0887 1.0872 1.0930 1.0963 1.0966 1.0766
irintensity: 0.1660 1.1344 1.2032 0.4187 0.0083 1.3178 0.0013 0.5995 4.5188 3.3751 0.0522 2.3614 20.1390 9.6882 12.3271 9.6136 4.6853 1.8720 6.9586 0.2629 11.9495 7.7403 28.5243 17.0066 9.7555 29.7423 38.7393 33.0398 62.8038 20.8297 11.0272 46.2087 42.8553 12.9688 0.1836 0.5836 11.8058 9.8242 53.1527 2.1307 11.0443 2.6218 56.0209 38.1421 30.2632 60.4143 13.5069 5.4313 74.4125 6.1647 0.9967 112.4375 52.8612 11.8119 19.8091 35.9351 38.4156 105.5362 406.2740 2.5829 3.2751 3.1856 0.7062 9.8361 5.1057 39.8540
temp: 298.150 k
press: 1.00000 atm
elementType: 17 17 8 7 6 6 6 6 6 6 6 6 6 6 6 6 6 1 1 1 1 1 1 1
symmnumber: 1
zpe: 432677.7 jmol-1
zpe.correction: 0.164798 hartree
zpe.thermalcorrener: 0.178046 hartree
zpe.thermalcorrenthalpy: 0.178991 hartree
zpe.thermalcorrgfe: 0.124063 hartree
zpe.sumelectzpe: -1548.574790 hartree
zpe.sumelectthermal: -1548.561542 hartree
zpe.sumelectthermalent: -1548.560598 hartree
zpe.sumelectthermalfe: -1548.615526 hartree
dipole: -2.0892 -3.1029 0.0002
dipole: 3.7406
quadrupole: -123.4051 -106.3626 -114.9784
quadrupole: -9.5342 0.0004 -0.0016
quadrupole: -8.4898 8.5527 -0.0630 -9.5342 0.0004 -0.0016
hfenergy: -1548.7395886 hartree
pointgroup: C01 [X(C13H7Cl2N1O1)]
dipole: -0.8436332 -1.2058771 0.0000621 debye
dipolederiv: -1.0458896 0.0748679 -0.0000066 0.0330187 -0.1037 0.0000025 0.0000021 0.0000028 -0.0533296 -1.0444601 0.0084734 -0.0000063 0.0879468 -0.114897 0.0000092 -0.0000124 0.000009 -0.0556839 -0.7391469 -0.3064728 0.0000078 -0.4574568 -1.2320269 0.0000376 0.0000282 0.0000747 -0.3604379 -1.0601459 -0.6296823 0.0000473 -0.1355938 -0.5485695 0.000027 -0.000041 0.0000025 -0.3007361 0.4950355 0.0432702 -0.0000044 -0.1450213 0.0192719 0.0000056 -0.0000079 0.0000023 0.0263653 -0.1282627 -0.0191848 -0.0000096 -0.2024064 -0.2228055 0.0000203 0.0000264 0.0000308 -0.0093264 0.0313382 0.1841303 -0.000012 0.0267008 -0.4310252 0.0000285 0.0000065 0.0000259 0.0004816 0.3467923 0.4217377 -0.0000563 0.3426162 0.6151107 -0.000057 -0.0000402 -0.000041 0.1065788 1.3695422 0.4686904 0.0000187 0.239262 1.4358585 -0.0000583 0.0000431 -0.0000673 0.197948 -0.218056 0.0559168 0.0000034 0.1458332 0.0782686 -0.0000007 -0.0000025 -0.0000035 -0.1419606 0.2920231 0.022777 0.0000092 0.2231676 0.1398024 -0.0000442 -0.0000098 -0.0000475 -0.1181726 -0.4368163 -0.0627092 0.0000029 0.2775787 0.0028435 -0.0000013 -0.0000055 -0.0000106 -0.0574042 -0.413564 -0.2603909 0.0000296 -0.0766221 -0.0904989 -0.0000064 0.0000127 -0.0000123 -0.1529796 -0.2117788 0.0005474 -0.0000036 -0.0515985 0.0974535 -0.0000055 -0.0000032 -0.0000029 -0.0825711 -0.6596945 0.0474412 -0.0000189 0.2612227 -0.0786413 -0.0000151 -0.000053 -0.0000198 -0.1346129 1.4844255 -0.071078 0.0000067 -0.1761063 -0.0235113 -0.0000042 0.0000042 -0.0000027 -0.0856302 1.4449376 0.0177672 0.0000077 -0.3529168 0.2700495 -0.0000486 0.00006 -0.0000428 -0.0549265 0.1190441 -0.0024024 -0.0000078 -0.0196416 0.1930134 0.0000114 -0.0000014 0.000001 0.317996 0.0390577 -0.1049752 0.0000019 -0.0648365 -0.0282066 0.0000047 0.0000017 0.0000035 0.1456201 0.0615929 0.0984966 -0.0000174 0.0629073 -0.0355096 0.0000306 -0.0000127 0.0000329 0.1412071 0.1147462 -0.0091573 0.0000002 -0.0771638 0.0806027 0.000004 0.0000044 0.000006 0.1613108 0.0753031 0.019395 -0.0000022 0.0538922 -0.0329421 0.0000268 -0.0000099 0.0000232 0.1770908 0.0513141 0.0669684 -0.0000021 0.0707735 -0.0021137 0.0000062 -0.0000015 0.0000042 0.1600287 0.0326623 -0.0644269 0.0000119 -0.0655558 0.0121729 0.000027 0.0000114 0.0000315 0.1731444 unknown
polarizability: 321.035854|3.8563814|173.2463049|0.0001608|-0.0102372|61.5755871 unknown
InChI: InChI=1S/C13H7Cl2NO/c14-7-1-3-9-10-4-2-8(15)6-12(10)16-13(17)11(9)5-7/h1-6,16H
charge 0 multiplicity 1
24 atoms
Cl 5.293344 -0.628572 0.000052
Cl -5.469441 -0.178094 0.000002
O  1.313704 3.076478 -0.000208
N  -0.692617 1.904824 -0.000238
C  0.636439 -0.590052 0.000054
C  -0.832376 -0.539362 0.000052
C  1.383973 0.631407 -0.000018
C  -1.472704 0.741144 -0.00011
C  0.715225 1.961529 -0.000135
C  1.369216 -1.813703 0.00011
C  -1.66518 -1.692691 0.000228
C  2.801898 0.624541 -0.000018
C  -2.887718 0.853225 -0.000132
C  2.772484 -1.825824 0.00011
C  -3.066406 -1.59908 0.000216
C  3.483131 -0.598658 0.000052
C  -3.66286 -0.314345 0.000025
H  -1.157045 2.818375 -0.00036
H  0.843738 -2.773421 0.000134
H  -1.214999 -2.689985 0.000406
H  3.326487 1.58473 -0.000074
H  -3.36497 1.839458 -0.000258
H  3.319499 -2.773947 0.000142
H  -3.690422 -2.496977 0.000373
