program: Gaussian 09
title: 000265043
version: EM64L-G09RevD.01
frameworkgroup: C1[X(C15H13Cl2N)]
method: RPBEPBE
basis: SDD
operation: Freq
keyword: #p
keyword: freq=noraman
keyword: PBEPBE/SDD
title: #p freq=noraman PBEPBE/SDD
converged: YES YES NO NO
title: Mulliken charges:
elementType: Cl Cl N C C C C C C C C C C C C C C C H H H H H H H H H H H H H
charge: -0.062532 -0.061992 -0.078653 -0.375275 0.265338 0.277552 0.197148 0.169654 -0.361265 -0.406489 -0.393046 -0.383929 -0.620580 -0.628347 -0.129959 -0.102439 -0.235063 -0.222338 0.255734 0.267396 0.290406 0.246638 0.245735 0.196302 0.222882 0.235101 0.208580 0.221681 0.249453 0.256353 0.255953
chargesum: 0.00000
title: Mulliken charges with hydrogens summed into heavy atoms:
elementType: Cl Cl N C C C C C C C C C C C C C C C
charge: -0.062532 -0.061992 -0.078653 -0.119541 0.265338 0.277552 0.197148 0.169654 -0.093868 -0.116084 -0.146407 -0.138194 0.033705 0.051367 -0.129959 -0.102439 0.021290 0.033615
polarizability: 3.10972857e+02 -1.37206009e+00 1.85288073e+02 -6.11902934e-01 -1.52497000e+01 9.37786245e+01
1716.lowfreq: -7.8164 -4.6511 -0.0018 -0.0014 0.0013 4.5878 35.5483 66.5053 73.7056
frequency: 35.5211 66.5033 73.7053 100.3919 104.7449 113.4127 178.6862 217.0836 224.7185 234.6836 241.9944 243.7207 266.6775 314.3277 328.3555 362.1576 366.7987 388.6576 418.4142 450.0431 463.5913 524.7074 534.1526 555.7983 565.5368 615.9624 668.9075 685.3508 713.7459 756.9896 765.0002 818.0550 832.2281 836.0127 859.2685 881.4204 895.5729 913.3611 952.1843 953.8785 994.1953 1030.7020 1042.1222 1057.0850 1064.7202 1087.7822 1106.9334 1121.7440 1135.5155 1156.0591 1162.8937 1178.4641 1192.0544 1228.1407 1259.8800 1273.8131 1291.4781 1327.6155 1368.3350 1370.0607 1408.6362 1419.6823 1421.5674 1439.1834 1441.7601 1455.6079 1470.0161 1473.7563 1481.2243 1498.6559 1579.0070 1586.3041 1605.4755 1611.4077 2880.1108 2896.4440 2967.2081 3012.5633 3027.8178 3072.2082 3086.6420 3137.6574 3140.8270 3167.5551 3169.1402 3172.5538 3173.2911
redmass: 9.2832 3.6044 3.2622 4.6888 4.6371 8.5857 4.8105 1.8589 2.8244 9.8537 3.0688 1.0921 3.3988 4.0627 4.0941 4.6999 3.2254 12.1648 2.9123 3.3231 3.5166 5.3889 4.9494 5.6251 3.4946 6.0662 7.2924 5.0964 5.6852 3.3391 5.9667 1.4179 2.4059 1.7831 3.7282 2.1780 2.0487 1.9168 1.4007 1.3541 6.9991 2.4282 1.5211 1.8758 2.0533 1.2545 2.2300 1.7779 1.4474 1.8072 1.7042 1.9652 2.0302 1.6190 1.3210 2.7220 2.1151 1.5682 8.1754 3.8803 3.7961 1.8669 1.7824 1.2499 2.1133 1.0629 1.1533 3.2691 1.0585 1.0572 7.8966 8.4056 7.9249 7.5486 1.0536 1.0533 1.0818 1.0758 1.0778 1.1005 1.1003 1.0899 1.0898 1.0930 1.0929 1.0957 1.0959
irintensity: 0.5716 0.7001 0.0601 0.3827 0.1750 0.7126 0.7860 0.2907 0.3312 0.0523 0.9925 0.2304 3.1039 0.4676 6.4942 1.2982 1.7124 35.4283 7.9375 0.8365 12.8723 2.2157 0.0395 0.6907 1.3957 9.2645 39.9814 4.3834 2.1345 3.8362 2.8926 94.8183 1.2434 0.7487 6.2878 26.9268 14.9677 21.3049 0.1751 0.3516 16.5262 49.8362 11.1661 37.7904 24.8036 8.4474 6.1987 5.4630 3.3763 12.6748 40.6316 7.2346 6.7846 3.5023 16.1296 5.9041 1.3425 9.1549 10.7293 2.5270 70.1457 14.3493 9.5233 20.3258 77.0083 10.0229 18.6006 3.4052 8.8961 11.0913 13.0301 11.2080 10.1210 4.1152 79.8031 94.8439 10.5334 50.4123 35.4089 28.8477 29.7665 3.7687 11.5642 0.3796 3.2386 3.8543 6.5904
temp: 298.150 k
press: 1.00000 atm
elementType: 17 17 7 6 6 6 6 6 6 6 6 6 6 6 6 6 6 6 1 1 1 1 1 1 1 1 1 1 1 1 1
symmnumber: 1
zpe: 620671.8 jmol-1
zpe.correction: 0.236401 hartree
zpe.thermalcorrener: 0.252547 hartree
zpe.thermalcorrenthalpy: 0.253491 hartree
zpe.thermalcorrgfe: 0.192251 hartree
zpe.sumelectzpe: -1552.994394 hartree
zpe.sumelectthermal: -1552.978248 hartree
zpe.sumelectthermalent: -1552.977304 hartree
zpe.sumelectthermalfe: -1553.038544 hartree
dipole: 0.6425 -0.1398 0.3810
dipole: 0.7600
quadrupole: -140.1746 -103.6361 -120.2852
quadrupole: 3.1706 -0.6408 -3.7699
quadrupole: -18.8094 17.7292 1.0801 3.1706 -0.6408 -3.7699
hfenergy: -1553.2307949 hartree
pointgroup: C01 [X(C15H13Cl2N1)]
dipole: 0.2802465 -0.0177894 0.1026694 debye
polarizability: 303.0011244|4.998519|182.0956556|-38.60009|-25.3814832|104.9427745 unknown
InChI: InChI=1S/C15H13Cl2N/c1-18(2)15-13-7-9(16)3-5-11(13)12-6-4-10(17)8-14(12)15/h3-8,15H,1-2H3
charge 0 multiplicity 1
31 atoms
Cl 5.060243 0.216058 -1.193529
Cl -5.254196 -0.475672 0.783999
N  -0.369037 2.490962 -0.055369
C  -0.298532 1.165064 -0.711666
C  1.011266 0.34439 -0.597273
C  -1.326678 0.173389 -0.152991
C  0.738435 -0.953883 -0.068362
C  -0.709808 -1.060915 0.198356
C  2.321184 0.71092 -0.95282
C  -2.703889 0.378699 0.019376
C  1.777928 -1.890974 0.111341
C  -1.485518 -2.121578 0.715177
C  0.2695 3.595141 -0.795481
C  -0.037225 2.495182 1.38395
C  3.346306 -0.240231 -0.750692
C  -3.456252 -0.695498 0.541124
C  3.102548 -1.527548 -0.229453
C  -2.877657 -1.936222 0.886468
H  -0.511724 1.341954 -1.786998
H  2.554692 1.688467 -1.381994
H  -3.166156 1.338507 -0.22657
H  1.578531 -2.89305 0.505947
H  -1.031462 -3.079934 0.988871
H  1.384868 3.603069 -0.733807
H  -0.018179 3.547389 -1.861186
H  -0.087879 4.559115 -0.388766
H  1.047887 2.335887 1.590446
H  -0.329291 3.468571 1.817567
H  -0.607961 1.705685 1.9018
H  3.929438 -2.230976 -0.097289
H  -3.504377 -2.738366 1.286224
