program: Gaussian 09
title: 000024427
version: EM64L-G09RevD.01
frameworkgroup: C1[X(C3H3Cl)]
method: RPBEPBE
basis: SDD
operation: Freq
keyword: #pfreq=noraman
keyword: PBEPBE/SDD
title: #p freq=noraman PBEPBE/SDD
converged: NO YES YES YES
title: Mulliken charges:
elementType: Cl C C C H H H
charge: 0.064291 -0.740991 0.338953 -0.412470 0.250071 0.250077 0.250069
chargesum: 0.00000
title: Mulliken charges with hydrogens summed into heavy atoms:
elementType: Cl C C C
charge: 0.064291 0.009225 0.338953 -0.412470
polarizability: 2.15892514e+01 -1.19543412e+00 2.49417377e+01 -4.09958461e+00 1.28093438e+01 6.51364029e+01
1716.lowfreq: -0.0027 0.0030 0.0031 10.7709 12.0173 30.3085 181.3064 181.6851 341.1946
frequency: 181.3061 181.6831 341.1945 341.2564 537.4937 1032.8536 1032.9009 1067.2349 1404.2985 1463.1055 1463.2121 2279.3495 2979.3876 3070.1615 3070.5277
redmass: 4.6018 4.5988 6.0782 6.0757 7.7135 1.3751 1.3749 6.0195 1.2176 1.0411 1.0411 11.7599 1.0348 1.0987 1.0987
irintensity: 8.8848 8.8781 0.0003 0.0003 8.1608 7.7622 7.7524 7.7496 2.1449 14.6368 14.6449 12.0259 29.4668 13.8353 13.8454
temp: 298.150 k
press: 1.00000 atm
elementType: 17 6 6 6 1 1 1
symmnumber: 1
zpe: 122294.0 jmol-1
zpe.correction: 0.046579 hartree
zpe.thermalcorrener: 0.051645 hartree
zpe.thermalcorrenthalpy: 0.052589 hartree
zpe.thermalcorrgfe: 0.019162 hartree
zpe.sumelectzpe: -575.793526 hartree
zpe.sumelectthermal: -575.788461 hartree
zpe.sumelectthermalent: -575.787517 hartree
zpe.sumelectthermalfe: -575.820944 hartree
dipole: -0.1494 0.4669 1.6028
dipole: 1.6761
quadrupole: -30.7223 -30.1772 -23.6395
quadrupole: -0.1943 -0.6666 2.0829
quadrupole: -2.5426 -1.9975 4.5402 -0.1943 -0.6666 2.0829
hfenergy: -575.8401056 hartree
pointgroup: C01 [X(C3H3Cl1)]
dipole: 0.659437 0.0001334 -0.0000033 debye
dipolederiv: -0.5227916 0.0000515 0.0000308 0.0001921 0.1011421 0.0000127 -0.0000941 0.000013 0.1011661 0.0847451 -0.0000373 -0.0000189 -0.0001006 0.0766066 -0.000004 -0.0000471 0.000014 0.0766823 -0.0320205 0.0000771 0.0000326 0.0002361 -0.0598785 -0.0000072 0.0000387 -0.0000118 -0.0599111 0.4962391 -0.0001284 -0.0000434 -0.0002512 -0.2119719 -0.0000087 0.0000455 -0.0000086 -0.2119845 -0.0087345 0.033407 -0.05363 0.0546545 0.0778082 0.0946725 -0.0877845 0.094659 -0.0150819 -0.0086759 -0.0630905 -0.0021389 -0.1033441 -0.073855 -0.0071271 -0.0034593 -0.0071175 0.1365683 -0.0087618 0.0297206 0.0557678 0.0486132 0.0901485 -0.0875382 0.0913007 -0.087548 -0.0274392 unknown
polarizability: 69.2540259|-0.0029009|21.2067193|-0.0009815|0.0000303|21.2066469 unknown
InChI: InChI=1S/C3H3Cl/c1-2-3-4/h1H3
charge 0 multiplicity 1
7 atoms
Cl -2.278317 0.000143 0.000045
C  2.139325 0.000085 -0.000043
C  0.66828 -0.000098 -0.000051
C  -0.562509 -0.000064 -0.000004
H  2.535672 -0.545661 0.875526
H  2.535383 1.031323 0.034833
H  2.535667 -0.485228 -0.910506
