program: Gaussian 09
title: 000265041
version: EM64L-G09RevD.01
frameworkgroup: C1[X(C15H14FN)]
method: RPBEPBE
basis: SDD
operation: Freq
keyword: #p
keyword: freq=noraman
keyword: PBEPBE/SDD
title: #p freq=noraman PBEPBE/SDD
converged: NO YES NO NO
title: Mulliken charges:
elementType: F N C C C C C C C C C C C C C C C H H H H H H H H H H H H H H
charge: -0.208549 -0.077075 -0.374426 0.288764 0.272781 0.184024 0.154632 -0.573109 -0.427237 -0.368161 -0.397548 -0.621116 -0.629504 0.332030 -0.236745 -0.389418 -0.233586 0.251865 0.268544 0.265455 0.245699 0.238741 0.221809 0.195096 0.232596 0.218289 0.206284 0.251619 0.227457 0.254593 0.226194
chargesum: 0.00000
title: Mulliken charges with hydrogens summed into heavy atoms:
elementType: F N C C C C C C C C C C C C C C C
charge: -0.208549 -0.077075 -0.122560 0.288764 0.272781 0.184024 0.154632 -0.304565 -0.161782 -0.122462 -0.158807 0.028385 0.046687 0.332030 -0.009288 -0.134825 -0.007391
polarizability: 2.36023192e+02 -7.66146938e-01 1.80339826e+02 -1.30572264e+00 -1.50860670e+01 8.98512266e+01
1716.lowfreq: -5.8798 0.0005 0.0009 0.0012 3.7980 7.3309 52.5583 76.1795 83.8020
frequency: 52.5291 76.1707 83.7984 111.9476 144.1542 173.4197 216.4655 230.8074 245.9923 267.2028 304.2831 336.5155 341.6891 354.8956 397.9162 420.3854 446.2999 466.8660 522.0731 530.7740 556.9924 574.6085 617.3579 666.9284 701.6465 715.1570 746.4062 767.6836 788.5266 825.3373 837.3173 864.9956 877.1655 893.3742 918.0306 946.2142 954.2534 988.4703 995.4203 1024.0823 1028.8902 1042.1391 1086.4506 1089.5011 1100.6409 1126.5346 1137.1975 1157.2628 1168.3513 1178.5147 1189.0728 1198.4784 1242.2201 1271.3277 1275.0611 1298.1689 1327.2016 1375.7144 1389.8070 1419.4235 1429.6153 1438.1052 1441.6369 1455.2912 1460.7985 1471.2237 1481.4789 1484.0550 1498.7592 1595.0485 1595.3139 1615.6252 1620.4371 2876.4744 2893.3438 2966.7224 3008.8443 3024.9938 3069.3682 3086.4434 3123.7380 3134.3771 3140.5743 3147.3520 3162.7345 3172.7729 3177.1540
redmass: 4.1156 2.8814 4.9019 3.4820 3.8885 5.2162 3.0472 1.3707 1.0817 2.9282 4.0308 5.3291 3.9306 3.9025 4.8825 2.9808 3.0729 3.6081 4.4406 4.9725 5.1311 3.7574 5.4682 5.7082 5.0949 4.9764 1.9317 2.3063 3.1286 1.5676 2.8138 2.8785 1.5342 1.9273 4.0538 1.3794 1.4415 1.3398 6.3550 2.1204 2.4245 1.5111 1.4064 1.6769 1.7355 1.4114 1.4597 1.4534 1.2017 2.0726 2.4690 2.1399 2.0267 2.1455 1.8431 2.0083 1.5861 9.2844 3.5311 1.1365 4.8417 1.2277 2.1420 1.0647 2.6928 1.0702 1.1295 3.2607 1.0639 7.4729 7.2332 7.7112 7.2860 1.0538 1.0536 1.0819 1.0754 1.0777 1.1003 1.0998 1.0854 1.0895 1.0901 1.0946 1.1003 1.0927 1.0956
irintensity: 0.5022 0.1121 0.4504 0.8462 1.7893 0.0070 1.6186 0.4241 0.2069 4.0870 0.8525 6.4656 0.1446 6.2421 3.2134 6.2872 0.1865 7.1671 0.0506 6.7653 5.5667 5.9093 6.1716 0.7573 5.3291 1.6934 35.8149 70.7755 30.7981 24.3694 3.5259 0.5199 18.3125 10.7922 7.7961 0.1466 4.0199 0.5441 4.3210 9.5544 48.8703 11.1290 4.7926 16.3603 3.5965 11.6582 5.1331 4.3250 6.7955 9.9671 29.4055 14.6393 21.4953 3.1090 7.0191 4.1129 10.1943 11.7404 1.4222 8.4376 27.3023 15.0040 60.4522 10.3285 30.0758 17.2675 5.5556 18.4379 11.9835 22.4708 2.9826 8.5702 4.2311 83.7755 99.5352 12.9069 54.3725 39.1363 31.3149 28.2856 1.7098 6.3489 6.6041 25.7295 35.6531 2.8664 6.2713
temp: 298.150 k
press: 1.00000 atm
elementType: 9 7 6 6 6 6 6 6 6 6 6 6 6 6 6 6 6 1 1 1 1 1 1 1 1 1 1 1 1 1 1
symmnumber: 1
zpe: 649921.5 jmol-1
zpe.correction: 0.247542 hartree
zpe.thermalcorrener: 0.261882 hartree
zpe.thermalcorrenthalpy: 0.262826 hartree
zpe.thermalcorrgfe: 0.206640 hartree
zpe.sumelectzpe: -733.384633 hartree
zpe.sumelectthermal: -733.370293 hartree
zpe.sumelectthermalent: -733.369349 hartree
zpe.sumelectthermalfe: -733.425535 hartree
dipole: 1.6484 0.1834 0.2555
dipole: 1.6782
quadrupole: -104.9130 -86.5558 -100.9897
quadrupole: -2.2745 0.0013 -3.5487
quadrupole: -7.4268 10.9304 -3.5036 -2.2745 0.0013 -3.5487
hfenergy: -733.6321751 hartree
pointgroup: C01 [X(C15H14F1N1)]
dipole: 0.643248 0.1081301 0.1022954 debye
polarizability: 235.9181835|2.5208316|181.0659459|-0.4993869|-13.1323635|89.2301147 unknown
InChI: InChI=1S/C15H14FN/c1-17(2)15-13-6-4-3-5-11(13)12-8-7-10(16)9-14(12)15/h3-9,15H,1-2H3
charge 0 multiplicity 1
31 atoms
F  -4.522401 -0.689804 -0.105051
N  0.192444 2.426734 0.237126
C  0.187435 1.176636 -0.562009
C  -0.930412 0.13703 -0.298904
C  1.449603 0.333013 -0.343624
C  -0.358552 -1.135495 0.010811
C  1.113906 -1.013837 -0.026303
C  -2.326349 0.298763 -0.350353
C  2.789183 0.743735 -0.422034
C  -1.180452 -2.251568 0.278257
C  2.128703 -1.969788 0.19765
C  -0.755232 3.464149 -0.208666
C  0.18565 2.232802 1.70065
C  -3.116407 -0.833763 -0.066234
C  3.8103 -0.213633 -0.193516
C  -2.586618 -2.099048 0.245121
C  3.48008 -1.558788 0.109445
H  0.135663 1.493219 -1.625072
H  -2.808088 1.245352 -0.607745
H  3.031796 1.78895 -0.641158
H  -0.746792 -3.230904 0.506562
H  1.883508 -3.010172 0.439373
H  -0.69911 3.575021 -1.306693
H  -1.81929 3.265027 0.068493
H  -0.474896 4.432118 0.246916
H  0.415229 3.195628 2.192312
H  -0.791577 1.866792 2.097157
H  0.967508 1.507989 1.983814
H  4.862847 0.085647 -0.250307
H  -3.2630 -2.934026 0.448698
H  4.281618 -2.286078 0.281583
