program: Gaussian 09
title: 000265044
version: EM64L-G09RevD.01
frameworkgroup: C1[X(C15H14Cl2N2)]
method: RPBEPBE
basis: SDD
operation: Freq
keyword: #p
keyword: freq=noraman
keyword: PBEPBE/SDD
title: #p freq=noraman PBEPBE/SDD
converged: YES YES NO NO
title: Mulliken charges:
elementType: Cl Cl N N C C C C C C C C C C C C C C C H H H H H H H H H H H H H H
charge: -0.074518 -0.065472 -0.081012 -0.700148 -0.389826 0.303367 0.255259 -0.002906 0.232703 0.396736 -0.436921 -0.412300 -0.353185 -0.628674 -0.620229 -0.444679 -0.093835 -0.101626 -0.255244 0.253461 0.266857 0.290684 0.205119 0.247595 0.210985 0.218800 0.232675 0.198788 0.221481 0.243373 0.252475 0.314281 0.315938
chargesum: 0.00000
title: Mulliken charges with hydrogens summed into heavy atoms:
elementType: Cl Cl N N C C C C C C C C C C C C C C C
charge: -0.074518 -0.065472 -0.081012 -0.069929 -0.136365 0.303367 0.255259 -0.002906 0.232703 0.396736 -0.170065 -0.121616 -0.148066 0.048705 0.032716 -0.201306 -0.093835 -0.101626 -0.002769
polarizability: 3.18212353e+02 -7.89554215e-01 2.08764361e+02 4.95312728e-01 -1.45986628e+01 9.74242487e+01
1716.lowfreq: -9.1993 -5.5187 -1.8543 -0.0006 0.0013 0.0014 26.3950 56.7664 65.6965
frequency: 26.2597 56.7555 65.6944 72.9736 100.4682 119.4570 155.6142 199.6498 214.3356 223.9004 229.1572 239.7928 243.9348 262.0984 281.4206 304.1902 315.4565 334.3212 380.3260 387.4846 400.6574 410.0094 439.2329 462.1616 493.9784 536.6884 557.4467 562.8035 579.1998 585.7424 650.4966 687.0634 701.9933 750.6520 756.4935 799.6659 818.9892 845.7634 847.0886 862.7347 882.9362 912.1426 925.7016 983.8365 991.8360 1022.3125 1042.5134 1058.9524 1069.4345 1087.3106 1101.0944 1126.4116 1136.7663 1163.4566 1177.9166 1199.0850 1209.4735 1254.4215 1273.6005 1277.6833 1302.4177 1327.7226 1367.4552 1395.1172 1419.2412 1425.0428 1432.3883 1438.8375 1451.6828 1455.6011 1468.6484 1474.0393 1481.9716 1499.7383 1581.8470 1588.1785 1605.5831 1609.1768 1642.2483 2883.9945 2898.3743 2965.7104 3010.4813 3025.7006 3070.1961 3083.8437 3137.1868 3151.5415 3165.3162 3169.7642 3185.3546 3578.8258 3725.1201
redmass: 6.5635 4.3088 3.5410 3.3712 3.8418 9.8220 5.3286 4.1213 1.3665 5.4693 2.6053 3.0365 1.4241 3.3065 4.5169 1.3691 3.9761 3.3425 3.0589 6.9083 3.2523 1.4804 2.9636 3.3211 6.6140 4.1833 3.9258 4.3313 4.3131 6.7861 5.3403 4.7326 5.3477 5.7354 2.4754 2.0286 2.0074 1.7415 3.6471 2.4513 2.7806 1.9024 1.4192 4.4581 5.0002 1.9817 1.5119 2.0917 2.1937 1.2565 1.5393 2.0754 1.4422 1.5607 1.8143 1.9516 1.6984 1.6273 2.5988 2.1274 3.2556 1.5702 5.6833 5.2594 1.1569 3.7980 3.1587 1.1651 4.0810 1.0648 1.1314 3.8422 1.0539 1.0571 7.8901 8.0388 7.5819 5.1565 1.2688 1.0529 1.0528 1.0817 1.0766 1.0784 1.1004 1.1002 1.0881 1.0922 1.0930 1.0957 1.0928 1.0463 1.1020
irintensity: 3.0098 2.7992 0.4948 0.2905 0.4489 1.1012 6.3515 2.4657 0.8296 1.9522 0.9047 0.1847 1.3184 1.7658 5.6274 58.8873 0.6128 14.9440 73.6235 41.0189 5.5435 41.9811 40.4715 26.4236 0.0077 0.8456 7.5337 8.9406 2.3036 1.7260 25.1498 2.5609 9.3797 1.6890 33.1826 36.9381 13.6575 26.7578 26.8305 10.2404 43.3611 19.6192 0.6780 5.2676 43.4717 31.0935 10.0657 25.0841 33.1266 4.8228 13.1516 12.6956 1.3284 10.8043 8.2856 6.7620 7.8851 22.8863 11.6254 19.5533 67.7931 8.7609 7.5369 5.9129 9.9962 79.6712 22.6563 2.2491 74.3682 9.0391 22.7100 4.8063 6.6796 10.9197 21.6588 96.4618 25.3190 77.1632 249.0277 76.6569 95.7334 10.4694 53.4137 35.8775 29.6033 31.7083 25.6657 5.9711 0.5212 8.6310 0.6374 48.8733 30.9599
temp: 298.150 k
press: 1.00000 atm
elementType: 17 17 7 7 6 6 6 6 6 6 6 6 6 6 6 6 6 6 6 1 1 1 1 1 1 1 1 1 1 1 1 1 1
symmnumber: 1
zpe: 663194.0 jmol-1
zpe.correction: 0.252597 hartree
zpe.thermalcorrener: 0.270526 hartree
zpe.thermalcorrenthalpy: 0.271470 hartree
zpe.thermalcorrgfe: 0.206360 hartree
zpe.sumelectzpe: -1608.270708 hartree
zpe.sumelectthermal: -1608.252779 hartree
zpe.sumelectthermalent: -1608.251834 hartree
zpe.sumelectthermalfe: -1608.316945 hartree
dipole: -0.7254 -2.1698 0.8610
dipole: 2.4445
quadrupole: -148.0701 -100.1642 -127.5947
quadrupole: 1.1666 -0.5288 -5.1138
quadrupole: -22.7938 25.1122 -2.3184 1.1666 -0.5288 -5.1138
hfenergy: -1608.5233049 hartree
pointgroup: C01 [X(C15H14Cl2N2)]
dipole: -0.2486866 -0.8697462 0.3265885 debye
polarizability: 318.0680383|3.9808402|209.2728664|1.6440747|-13.056782|97.0600581 unknown
InChI: InChI=1S/C15H14Cl2N2/c1-19(2)15-11-5-8(16)3-4-10(11)14-12(15)6-9(17)7-13(14)18/h3-7,15H,18H2,1-2H3
charge 0 multiplicity 1
33 atoms
Cl -5.199166 -0.103887 -0.231611
Cl 5.326477 0.212791 -0.161403
N  0.104551 2.567383 0.339761
N  -1.16854 -3.322258 0.467813
C  0.039621 1.344098 -0.493381
C  -1.140499 0.364649 -0.291049
C  1.242802 0.423568 -0.281743
C  -0.654279 -0.950553 -0.024406
C  0.825906 -0.92077 -0.035769
C  -1.57554 -2.019239 0.19581
C  -2.513239 0.654626 -0.368952
C  2.593231 0.792773 -0.318803
C  1.817164 -1.917766 0.14262
C  0.042948 2.334967 1.796618
C  -0.750188 3.684354 -0.102863
C  -2.972354 -1.7273 0.130177
C  -3.399834 -0.422213 -0.149474
C  3.552677 -0.223729 -0.123732
C  3.188406 -1.566188 0.096885
H  0.031598 1.690847 -1.548315
H  -2.890787 1.652287 -0.599533
H  2.882453 1.835285 -0.477804
H  1.578626 -2.972559 0.311035
H  0.770734 1.555898 2.081309
H  -0.965693 2.019015 2.154039
H  0.317318 3.267731 2.32191
H  -0.408335 4.617075 0.383122
H  -1.832068 3.559791 0.143753
H  -0.657309 3.815985 -1.196015
H  -3.706872 -2.521851 0.296968
H  3.960941 -2.328268 0.235031
H  -0.190207 -3.561981 0.572712
H  -1.858146 -4.054857 0.60949
