program: Gaussian 09
title: 000265036
version: EM64L-G09RevD.01
frameworkgroup: C1[X(C13H8FNO)]
method: RPBEPBE
basis: SDD
operation: Freq
keyword: #p
keyword: freq=noraman
keyword: PBEPBE/SDD
title: #p freq=noraman PBEPBE/SDD
converged: NO YES NO YES
title: Mulliken charges:
elementType: F O N C C C C C C C C C C C C C H H H H H H H H
charge: -0.203581 -0.404995 -0.023983 0.229863 0.241192 0.245525 0.242916 -0.282540 -0.363967 -0.407061 -0.581357 -0.398131 -0.381182 0.351939 -0.226957 -0.236283 0.252186 0.248500 0.300424 0.297750 0.256773 0.230211 0.233043 0.379716
chargesum: 0.00000
title: Mulliken charges with hydrogens summed into heavy atoms:
elementType: F O N C C C C C C C C C C C C C
charge: -0.203581 -0.025280 -0.023983 0.229863 0.241192 0.245525 0.242916 -0.282540 -0.111781 -0.158561 -0.280933 -0.100381 -0.124408 0.351939 0.003254 -0.003240
polarizability: 2.34629223e+02 1.43039760e+00 1.91809495e+02 1.02256607e-02 -5.84595103e-03 5.64671549e+01
1716.lowfreq: -0.0003 0.0003 0.0005 0.9106 8.2117 10.2182 74.6027 107.7533 133.2138
frequency: 74.5916 107.7518 133.2131 160.0778 189.8794 200.2155 275.3215 329.9984 347.6337 368.2776 396.9360 399.2605 445.6932 459.9564 515.6382 524.8159 544.4320 564.5825 583.6690 653.3193 662.2925 718.5496 734.9719 750.4681 786.8981 799.9125 810.2141 829.4600 892.5063 900.9435 917.1499 949.7377 965.0300 978.4807 995.9225 996.3855 1032.2157 1073.7887 1106.7840 1129.2137 1167.6896 1174.9358 1215.8422 1239.3947 1270.1702 1298.6229 1320.0017 1376.5380 1396.5369 1440.3064 1450.2166 1459.0630 1482.9099 1581.4366 1596.2804 1599.3620 1616.6757 1625.6602 3128.9122 3142.5303 3146.2978 3161.0823 3177.5941 3181.9603 3196.3100 3557.7186
redmass: 6.4026 5.6232 3.9196 7.4064 5.7261 6.6817 8.0966 9.1216 4.8803 8.6509 6.7069 2.8245 2.5596 1.9135 2.2614 5.8350 6.9524 6.4860 3.3290 7.2763 4.2238 5.7505 6.2861 1.6912 2.5969 2.4176 8.2233 1.5976 1.4899 1.5723 9.0875 1.3947 1.4249 3.9196 1.3432 5.5381 1.9587 2.5868 1.6241 1.6320 1.6849 1.3193 2.3125 2.3272 1.7553 1.4936 1.6937 8.4740 3.3350 2.8130 3.3765 3.4718 4.3706 7.2108 7.0168 8.3173 7.4695 7.8081 1.0861 1.0915 1.0900 1.0979 1.0956 1.0940 1.0953 1.0675
irintensity: 0.0006 1.9911 0.0211 0.0396 0.1253 5.8117 1.0245 0.5106 0.2462 7.4928 3.7934 26.7607 1.2218 45.9486 68.3925 0.8981 5.3613 5.2909 11.0683 5.0096 4.4726 4.2926 12.6308 79.2863 30.0298 18.2259 85.4727 20.8287 19.4428 17.1292 148.7405 0.2879 6.3879 8.2936 0.4489 2.8590 2.4712 9.0977 3.2277 18.9957 35.2090 27.8864 10.0573 46.8983 13.0062 36.1925 32.9779 5.7248 2.3965 27.2897 111.9235 15.6446 17.6450 2.6983 24.6304 9.7825 11.8801 9.4572 1.8257 11.2423 8.7234 31.4656 3.8326 2.4517 5.3646 91.0969
temp: 298.150 k
press: 1.00000 atm
elementType: 9 8 7 6 6 6 6 6 6 6 6 6 6 6 6 6 1 1 1 1 1 1 1 1
symmnumber: 1
zpe: 456436.6 jmol-1
zpe.correction: 0.173848 hartree
zpe.thermalcorrener: 0.185762 hartree
zpe.thermalcorrenthalpy: 0.186706 hartree
zpe.thermalcorrgfe: 0.135930 hartree
zpe.sumelectzpe: -728.884698 hartree
zpe.sumelectthermal: -728.872784 hartree
zpe.sumelectthermalent: -728.871840 hartree
zpe.sumelectthermalfe: -728.922616 hartree
dipole: 2.5331 -0.7385 0.0001
dipole: 2.6385
quadrupole: -91.7029 -70.4296 -95.8734
quadrupole: 4.5314 -0.0001 -0.0011
quadrupole: -5.7010 15.5724 -9.8714 4.5314 -0.0001 -0.0011
hfenergy: -729.0585458 hartree
pointgroup: C01 [X(C13H8F1N1O1)]
dipole: -0.997406 -0.2877118 -0.0000417 debye
dipolederiv: -1.3014128 -0.1863914 -0.0000826 -0.313223 -0.2573642 -0.0000252 -0.0000878 -0.0000181 -0.152373 -0.7150401 1.2342805 0.0000309 0.3628985 -0.6533496 0.0000157 0.0000053 0.0000546 -0.3538619 0.2240757 -1.1131775 -0.0000264 -0.3337084 0.3350395 0.000006 -0.0000125 -0.0000142 -0.1583384 0.1593636 -0.203752 0.0000005 0.1558025 -0.151446 0.000004 0.0000039 -0.0000154 -0.0249551 0.2947367 0.2635578 0.0000297 0.0187251 0.0145924 0.0000007 0.0000274 0.0000197 0.0094469 -0.0295941 -0.123601 -0.0000039 -0.2283017 0.1489094 -0.0000126 -0.0000059 -0.000007 0.0302037 -0.4054603 -0.0023873 -0.0000281 0.0526844 -0.0018348 -0.0000004 -0.0000271 -0.0000082 0.0704525 0.4547188 0.116478 0.000032 0.2195036 -0.0642739 0.0000055 0.0000439 -0.00001 0.0054431 0.0073076 0.078503 0.0000116 0.0121051 0.1195744 0.0000135 0.0000123 0.0000153 -0.140208 -0.2173048 -0.2307571 -0.000012 -0.1044866 0.0373235 0.0000036 -0.0000095 -0.0000054 -0.1642338 -0.2521283 0.0438568 -0.0000065 0.1828069 -0.0117562 0.000018 0.0000007 0.0000088 -0.1461819 0.0944966 -0.011248 0.0000123 -0.0839152 0.0499127 0.000004 0.0000081 0.0000091 -0.134022 -0.1847274 -0.0580371 -0.0000015 -0.2650174 -0.1654543 -0.0000153 -0.0000131 -0.0000038 -0.1589406 1.3446729 0.1594819 0.0000895 0.3612333 0.3677861 0.0000356 0.0000958 0.0000249 0.0804539 0.0640036 0.1429624 0.0000143 0.1189894 0.0192808 0.000015 0.0000143 0.0000138 -0.1377097 0.0385751 -0.0113098 0.0000083 -0.0747242 -0.0603933 0.0000007 0.0000082 0.0000061 -0.1802246 0.0827146 -0.06637 -0.0000078 -0.0237357 -0.0690289 -0.0000121 -0.0000047 -0.0000131 0.1539456 0.058384 0.0977392 -0.0000005 0.0529768 -0.0648278 -0.000007 -0.0000034 -0.000003 0.1561362 0.1074018 0.0006864 -0.0000052 -0.0439576 0.0192931 -0.0000107 -0.0000057 -0.0000063 0.1825623 0.0905256 0.0188802 -0.0000028 0.0725166 0.0069004 -0.0000035 -0.0000016 -0.0000059 0.171745 -0.0048173 0.0681242 -0.0000088 0.0787691 0.0442351 -0.0000015 -0.0000093 -0.0000021 0.1814481 -0.0070417 -0.1030372 -0.0000131 -0.1213289 -0.0474521 -0.0000156 -0.0000127 -0.000014 0.1583614 -0.1328394 0.0032373 -0.0000142 0.0201055 0.0836244 -0.0000028 -0.0000133 -0.0000045 0.1633823 0.2293896 -0.1177192 -0.0000156 -0.1167181 0.3007092 -0.0000158 -0.0000135 -0.0000215 0.387468 unknown
polarizability: 234.6207365|-1.5522045|191.8179809|0.0102423|0.0058168|56.4671549 unknown
InChI: InChI=1S/C13H8FNO/c14-8-5-6-10-9-3-1-2-4-11(9)13(15-16)12(10)7-8/h1-7,16H
charge 0 multiplicity 1
24 atoms
F  4.577169 0.359775 0.000468
O  -1.652057 3.212701 0.00019
N  -0.318201 2.634129 0.000223
C  0.566234 -0.864437 0.000142
C  -0.907558 -0.985551 0.000052
C  0.899727 0.527052 0.000231
C  -1.479416 0.331737 0.000084
C  -0.364573 1.310956 0.000165
C  1.585896 -1.83682 0.000164
C  -1.736989 -2.121616 -0.000041
C  2.235753 0.965018 0.000345
C  -2.878434 0.5109 0.000028
C  2.938292 -1.418348 0.000275
C  3.22293 -0.038053 0.000363
C  -3.1430 -1.939078 -0.0001
C  -3.706505 -0.639517 -0.000066
H  1.350127 -2.905834 0.0001
H  -1.313075 -3.13169 -0.000063
H  2.504889 2.023876 0.000409
H  -3.306069 1.514897 0.00005
H  3.762284 -2.137549 0.000295
H  -3.802782 -2.813889 -0.000172
H  -4.795634 -0.522519 -0.000114
H  -1.464109 4.186658 0.000268
