program: Gaussian 09
title: 000265031
version: EM64L-G09RevD.01
frameworkgroup: C1[X(C13H8Br2Cl2N2)]
method: RPBEPBE
basis: SDD
operation: Freq
keyword: #p
keyword: freq=noraman
keyword: PBEPBE/SDD
title: #p freq=noraman PBEPBE/SDD
converged: NO NO NO NO
title: Mulliken charges:
elementType: Br Br Cl Cl N N C C C C C C C C C C C C C H H H H H H H H
charge: -0.005959 0.004348 -0.056218 -0.064418 -0.693263 -0.681361 -0.699761 0.401220 0.399182 0.212693 0.251405 -0.698101 -0.616029 -0.393629 -0.475929 0.845011 0.779679 -0.507574 -0.371751 0.276890 0.276889 0.258580 0.264266 0.323557 0.323885 0.322879 0.323511
chargesum: 0.00000
title: Mulliken charges with hydrogens summed into heavy atoms:
elementType: Br Br Cl Cl N N C C C C C C C C C C C C C
charge: -0.005959 0.004348 -0.056218 -0.064418 -0.045821 -0.034971 -0.145983 0.401220 0.399182 0.212693 0.251405 -0.698101 -0.616029 -0.135050 -0.211663 0.845011 0.779679 -0.507574 -0.371751
polarizability: 3.70007027e+02 -1.31308703e+00 2.59813541e+02 1.80705104e-02 1.31507920e-02 7.55427607e+01
1716.lowfreq: -0.0009 0.0014 0.0019 3.0386 5.1438 5.9238 36.5330 53.2821 73.1599
frequency: 36.5310 53.2773 73.1584 84.1347 102.3455 117.1227 151.0083 166.7156 167.0368 177.4421 225.0906 268.3032 272.7299 282.3815 289.5438 302.7112 319.1216 345.6079 364.6255 386.0527 436.2076 453.3155 458.3402 462.2563 464.0452 497.5485 500.6232 558.0473 571.7454 575.4728 614.5848 654.2682 669.6000 703.1016 737.9415 751.5417 757.9256 771.6440 830.3329 869.4096 876.2057 936.6581 972.7764 981.9579 1030.2943 1061.5332 1074.0061 1136.8633 1147.8292 1183.2646 1236.5476 1237.0214 1284.1601 1341.3084 1363.9407 1371.3343 1422.7094 1443.5708 1457.7928 1464.9666 1485.3811 1551.0368 1570.3517 1605.2558 1606.6365 1633.2960 1640.2809 2994.0688 3037.4557 3161.9672 3163.8289 3536.4722 3543.9865 3680.6051 3690.1521
redmass: 27.7238 7.9012 21.5907 6.7158 8.3113 34.4096 3.6551 23.8727 6.8262 25.5686 20.8599 4.5731 5.7150 2.7540 5.2513 5.6036 8.6561 8.1696 7.7084 5.6001 4.4906 1.0265 1.1726 1.2389 1.0761 4.9595 5.0685 4.1994 9.2831 4.1810 3.9408 7.0134 6.5547 7.3907 6.3428 5.2723 6.3811 6.1730 9.2126 1.4189 1.5565 2.3122 2.8407 3.3565 9.4133 1.8161 1.7016 1.1281 5.4896 2.3416 1.5448 1.5734 2.7482 5.5594 5.8421 5.3846 1.1830 5.5685 6.0562 5.7240 5.9311 7.9820 6.0290 1.9975 1.6466 2.2887 3.3948 1.0612 1.0989 1.0926 1.0927 1.0448 1.0444 1.1043 1.1046
irintensity: 0.0036 0.8279 0.1381 0.7304 0.3917 0.0622 1.1084 0.5531 0.0004 0.2583 1.6664 0.6523 5.1249 22.6824 3.0099 6.6137 4.0439 6.2402 1.6792 0.0024 1.2513 0.9230 215.0453 274.0809 71.3126 0.8527 2.2769 5.0930 62.8924 3.1222 1.3251 5.2476 0.2276 66.7672 20.7328 5.3326 7.2217 1.9282 35.7389 31.1590 2.7126 7.3994 15.9279 23.5511 152.6891 96.1473 23.7611 0.0203 12.7055 3.3877 2.7735 13.8763 0.5270 47.8464 42.1500 23.3782 1.3222 9.7565 8.4661 463.4883 56.2378 47.2388 26.5082 70.6624 97.2903 192.8049 268.3850 4.0846 2.5563 1.5900 1.2441 155.3541 141.9008 49.2752 47.4899
temp: 298.150 k
press: 1.00000 atm
elementType: 35 35 17 17 7 7 6 6 6 6 6 6 6 6 6 6 6 6 6 1 1 1 1 1 1 1 1
symmnumber: 1
zpe: 469225.7 jmol-1
zpe.correction: 0.178719 hartree
zpe.thermalcorrener: 0.196617 hartree
zpe.thermalcorrenthalpy: 0.197562 hartree
zpe.thermalcorrgfe: 0.131252 hartree
zpe.sumelectzpe: -1555.444035 hartree
zpe.sumelectthermal: -1555.426137 hartree
zpe.sumelectthermalent: -1555.425192 hartree
zpe.sumelectthermalfe: -1555.491501 hartree
dipole: 0.0595 0.8882 -0.0007
dipole: 0.8902
quadrupole: -114.8104 -142.4191 -148.0382
quadrupole: -0.3644 -0.0046 0.0000
quadrupole: 20.2788 -7.3299 -12.9490 -0.3644 -0.0046 0.0000
hfenergy: -1555.6227539 hartree
pointgroup: C01 [X(C13H8Br2Cl2N2)]
dipole: -0.0083661 -0.3501392 -0.0002809 debye
polarizability: 369.915949|3.4281338|259.9046189|-0.017488|-0.013916|75.5427607 unknown
InChI: InChI=1S/C13H8Br2Cl2N2/c14-8-2-4-5-3-9(16)13(19)11(17)7(5)1-6(4)10(15)12(8)18/h2-3H,1,18-19H2
charge 0 multiplicity 1
27 atoms
Br 3.142835 -2.97747 -0.000073
Br 4.329837 2.762791 -0.000172
Cl -3.147128 -2.82354 0.000244
Cl -4.264801 2.646742 0.000108
N  4.891636 -0.342525 -0.000261
N  -4.902327 -0.324277 0.000588
C  -0.010555 -1.771124 0.000084
C  1.178133 -0.821119 0.0000
C  -1.193828 -0.816073 0.00015
C  0.728738 0.535743 0.00001
C  -0.741445 0.539366 0.000099
C  2.545587 -1.098685 -0.000076
C  -2.560639 -1.08744 0.000249
C  1.663222 1.592562 -0.000038
C  -1.671404 1.600923 0.000088
C  3.537027 -0.063241 -0.00015
C  -3.546023 -0.050862 0.000317
C  3.032392 1.277355 -0.000117
C  -3.038652 1.285153 0.00019
H  -0.010698 -2.436262 0.884974
H  -0.010807 -2.436278 -0.884793
H  1.344443 2.63855 -0.000013
H  -1.354659 2.64767 -0.000005
H  5.213758 -1.30728 -0.000216
H  5.567556 0.417657 -0.000249
H  -5.225238 -1.288461 0.000338
H  -5.572258 0.440926 0.000324
