program: Gaussian 09
title: 000265025
version: EM64L-G09RevD.01
frameworkgroup: C1[X(C8H12N4O4)]
method: RPBEPBE
basis: SDD
operation: Freq
keyword: #p
keyword: freq=noraman
keyword: PBEPBE/SDD
title: #p freq=noraman PBEPBE/SDD
converged: YES YES NO NO
title: Mulliken charges:
elementType: O O O O N N N N C C C C C C C C H H H H H H H H H H H H
charge: -0.250644 -0.455347 -0.465333 -0.236954 -0.239050 0.089113 -0.055847 -0.603723 -0.108117 -0.052979 -0.494435 -0.032117 -0.433797 0.132019 -0.379058 0.194049 0.227615 0.223022 0.247352 0.267971 0.288621 0.261680 0.231845 0.374991 0.351086 0.246567 0.347690 0.323778
chargesum: 0.00000
title: Mulliken charges with hydrogens summed into heavy atoms:
elementType: O O O O N N N N C C C C C C C C
charge: -0.250644 -0.080355 -0.114248 -0.236954 -0.239050 0.089113 -0.055847 0.067746 0.119498 0.170043 0.020888 0.256504 0.059728 0.132019 -0.132491 0.194049
polarizability: 1.69253989e+02 1.51719989e+01 1.35775509e+02 2.87826724e+00 -4.44873080e+00 8.48079969e+01
1716.lowfreq: -20.1022 -13.7353 -9.6905 -0.0003 -0.0002 0.0004 31.2461 34.5498 51.2621
frequency: 30.4352 33.3843 51.2601 72.6128 141.2701 142.0361 188.0928 192.3107 224.7876 234.8828 288.5807 327.3669 337.4890 349.5174 421.3720 426.9924 442.9750 473.9570 518.0060 533.4200 562.4596 568.5211 588.6454 650.1027 670.5295 689.5446 701.0556 733.1151 741.5133 769.9392 772.0292 821.0010 892.6443 903.0042 930.5225 940.4177 961.4094 967.2908 995.8645 1009.4627 1025.3914 1047.5614 1064.7554 1118.3566 1143.6460 1164.0790 1183.7131 1208.9325 1244.1539 1259.0849 1276.8461 1293.2697 1307.3483 1313.9159 1321.4915 1340.0909 1356.4146 1375.4268 1382.5138 1439.7475 1453.9794 1462.4798 1472.1725 1564.6482 1617.8831 1652.0385 2971.5519 3004.2729 3023.9656 3044.5231 3113.9727 3120.0893 3126.6399 3159.3065 3432.7835 3534.7487 3576.8156 3691.9102
redmass: 5.3001 6.5315 4.7886 5.2318 4.8535 3.3906 5.9178 5.2994 5.6115 5.9901 1.4229 2.8675 3.2641 4.7871 2.7816 3.5341 1.2871 4.6751 5.1782 4.1817 8.3063 5.5915 1.3249 1.1733 3.1398 4.9841 4.5491 6.6038 6.6856 3.5724 5.1231 1.4902 5.0625 2.9347 3.6243 3.5080 3.0717 2.3267 2.8677 3.0501 3.5231 2.0819 2.1483 1.6799 2.6766 2.2761 1.7943 3.3036 1.1257 1.3830 1.1949 1.2618 1.2892 1.3187 1.3150 1.4349 1.2616 1.3732 1.4494 4.9140 1.0888 1.0779 6.8550 3.5885 1.6840 5.8160 1.0846 1.0871 1.0653 1.0614 1.0929 1.0991 1.1015 1.0930 1.0657 1.0458 1.0665 1.1043
irintensity: 1.4752 2.4003 1.6302 4.6636 0.6620 16.5285 4.7991 3.4933 6.9312 1.6243 57.2817 43.0587 9.2082 48.2882 16.7006 18.0717 106.3578 8.9955 18.9913 22.7369 19.2820 22.2400 163.1011 170.0404 36.9478 4.6165 0.2475 37.6330 20.2964 4.1846 30.7727 38.0992 35.2761 24.4000 77.5909 102.0337 3.8764 16.9563 111.7821 39.2075 53.6436 27.7795 20.2228 11.4379 7.1933 43.9122 14.2377 165.7708 11.0661 5.4952 10.4028 3.3660 51.4506 26.1022 29.9997 3.9009 20.1247 23.0151 30.7401 35.5162 17.4103 6.3805 58.4630 198.1091 614.8688 214.5344 21.6366 61.9104 35.0392 7.4536 5.8405 12.2679 10.6892 5.8669 81.5980 120.7934 9.0506 44.5619
temp: 298.150 k
press: 1.00000 atm
elementType: 8 8 8 8 7 7 7 7 6 6 6 6 6 6 6 6 1 1 1 1 1 1 1 1 1 1 1 1
symmnumber: 1
zpe: 563383.4 jmol-1
zpe.correction: 0.214581 hartree
zpe.thermalcorrener: 0.229499 hartree
zpe.thermalcorrenthalpy: 0.230443 hartree
zpe.thermalcorrgfe: 0.171382 hartree
zpe.sumelectzpe: -830.692071 hartree
zpe.sumelectthermal: -830.677154 hartree
zpe.sumelectthermalent: -830.676209 hartree
zpe.sumelectthermalfe: -830.735271 hartree
dipole: -2.3441 -8.1984 0.1703
dipole: 8.5287
quadrupole: -88.4527 -88.1644 -96.2254
quadrupole: 17.6362 -10.2705 5.5708
quadrupole: 2.4948 2.7831 -5.2779 17.6362 -10.2705 5.5708
hfenergy: -830.9066522 hartree
pointgroup: C01 [X(C8H12N4O4)]
dipole: 0.9773675 -2.7808699 -1.6032828 debye
polarizability: 169.5081539|-15.4534529|119.7952145|-2.5663627|23.548028|100.5341266 unknown
InChI: InChI=1S/C8H12N4O4/c9-6-2-10-12(8(15)11-6)7-1-4(14)5(3-13)16-7/h2,4-5,7,13-14H,1,3,9H2
charge 0 multiplicity 1
28 atoms
O  -1.349502 0.239063 1.186067
O  -3.605742 0.808779 -1.368663
O  -4.467408 -1.457656 -0.009662
O  1.906115 1.914837 1.667908
N  0.810802 0.526461 0.111177
N  0.803493 -0.481444 -0.810155
N  3.173902 0.248472 0.592271
N  4.332101 -1.424071 -0.543332
C  -2.271757 0.273357 -1.090834
C  -2.184877 -0.550057 0.241736
C  -1.320299 1.475617 -0.869433
C  -0.51141 1.15022 0.400332
C  -3.544875 -0.763271 0.92199
C  2.000863 0.958188 0.860655
C  1.950826 -1.117347 -1.035433
C  3.160733 -0.74704 -0.310452
H  -1.931835 -0.36092 -1.931775
H  -1.681105 -1.520498 0.054394
H  -0.676055 1.679338 -1.737564
H  -1.952349 2.359047 -0.679258
H  -0.283898 2.009614 1.046396
H  -4.021425 0.205551 1.128425
H  -3.430506 -1.328406 1.865297
H  -4.252134 0.049887 -1.308222
H  -4.203969 -2.407756 -0.093347
H  1.923077 -1.917658 -1.77965
H  5.158082 -1.139044 -0.017539
H  4.394052 -2.187264 -1.211929
