program: Gaussian 09
title: 000265000
version: EM64L-G09RevD.01
frameworkgroup: C1[X(C13H11N3O2)]
method: RPBEPBE
basis: SDD
operation: Freq
keyword: #p
keyword: freq=noraman
keyword: PBEPBE/SDD
title: #p freq=noraman PBEPBE/SDD
converged: NO YES NO NO
title: Mulliken charges:
elementType: O O N N N C C C C C C C C C C C C C H H H H H H H H H H H
charge: -0.266442 -0.225101 -0.270388 0.001300 -0.025368 0.401997 0.358127 -0.475028 0.025557 0.160498 -0.747855 -0.786101 -0.329366 0.305570 -0.228707 -0.345621 -0.247922 -0.152061 0.241323 0.255448 0.221733 0.255463 0.241344 0.266166 0.241905 0.325916 0.270887 0.259343 0.267383
chargesum: 0.00000
title: Mulliken charges with hydrogens summed into heavy atoms:
elementType: O O N N N C C C C C C C C C C C C C
charge: -0.266442 -0.225101 -0.270388 0.001300 -0.025368 0.401997 0.358127 -0.233705 0.025557 0.160498 -0.015212 -0.036686 -0.003450 0.305570 -0.228707 -0.074734 0.011421 0.115322
polarizability: 3.48429988e+02 -3.82998024e+00 1.91399204e+02 1.02325865e-02 3.45825397e-03 7.40912701e+01
1716.lowfreq: -44.6765 -10.2877 -5.5806 -4.9323 -0.0004 0.0004 0.0005 24.3173 39.8940
frequency: -44.6685 23.8378 39.8601 63.8778 79.6548 104.6755 131.4377 166.9924 182.8908 212.9959 219.0756 242.6478 252.5512 276.7524 291.2966 359.5301 400.9476 407.7261 425.8319 460.9617 486.5421 509.3381 578.4117 586.1904 594.7104 614.7637 642.0989 652.2070 686.1547 742.9302 758.0460 771.4182 827.3983 845.1888 868.8085 871.9681 892.1128 921.2153 956.5104 989.6014 1009.3856 1017.4288 1036.8749 1040.0127 1047.4099 1055.1986 1059.2370 1122.2357 1139.5686 1174.7803 1213.4465 1229.3515 1236.5972 1325.1751 1366.3234 1372.4381 1397.9330 1401.5354 1405.9241 1447.8283 1458.6290 1462.3788 1469.7262 1471.3299 1529.3370 1545.8992 1566.7140 1579.2206 1631.2134 2174.9667 2986.0145 3002.3249 3062.8767 3086.4841 3111.6018 3111.9809 3135.2745 3169.8066 3225.9279 3243.9956 3270.4622
redmass: 1.0264 4.7319 5.5892 5.7716 5.5033 5.1238 8.5433 3.9682 2.1596 5.8176 1.4496 4.4624 5.3887 3.6892 2.9022 6.4003 6.6837 6.0339 5.6376 9.1529 5.8369 6.9171 6.0755 3.0430 4.7242 4.0681 4.1868 4.5518 6.5792 1.2625 8.7082 5.0875 1.3288 1.2477 7.6642 6.5981 1.3811 3.4615 2.0713 1.4305 1.6246 2.6964 1.8392 1.5721 1.5369 2.8759 3.2928 3.9628 1.8389 2.4930 3.3950 2.3586 1.5239 2.3306 4.4997 2.6126 1.4206 2.1526 1.2500 1.0468 1.1802 3.7837 1.0467 1.3200 7.6043 5.2328 7.4771 7.2896 7.0264 12.6310 1.0384 1.0362 1.0969 1.0965 1.0986 1.1011 1.0914 1.0923 1.0916 1.0995 1.1080
irintensity: 0.6628 0.0087 2.6407 0.4975 0.2071 0.0000 4.3335 1.3848 1.0240 1.2248 5.8030 4.1413 0.6546 19.5752 2.1775 3.6213 0.1665 1.4278 10.7065 1.8381 0.1816 9.6415 6.3421 9.0553 2.3898 4.1069 2.1631 2.5842 7.5065 86.0903 4.3385 20.3110 17.8996 20.6559 14.4394 5.4202 0.0802 2.5971 0.3107 24.5853 25.6237 2.7692 16.0010 8.8492 11.0397 65.1390 12.6968 4.6873 5.2527 8.2353 53.2319 5.1382 19.7367 63.6766 27.2965 0.2725 83.6616 7.2515 20.6430 14.8394 30.3451 128.1357 15.8167 3.5459 4.1754 44.2978 230.7260 78.6624 274.7872 41.0897 10.6698 11.6951 10.8426 6.8584 7.7414 24.0485 5.3375 5.1972 5.5038 0.2660 0.1000
temp: 298.150 k
press: 1.00000 atm
elementType: 8 8 7 7 7 6 6 6 6 6 6 6 6 6 6 6 6 6 1 1 1 1 1 1 1 1 1 1 1
symmnumber: 1
zpe: 559457.6 jmol-1
zpe.correction: 0.213086 hartree
zpe.thermalcorrener: 0.228929 hartree
zpe.thermalcorrenthalpy: 0.229873 hartree
zpe.thermalcorrgfe: 0.168533 hartree
zpe.sumelectzpe: -815.358561 hartree
zpe.sumelectthermal: -815.342718 hartree
zpe.sumelectthermalent: -815.341774 hartree
zpe.sumelectthermalfe: -815.403114 hartree
dipole: -3.2463 7.8095 0.0071
dipole: 8.4574
quadrupole: -83.8424 -111.7884 -106.2623
quadrupole: 20.2731 0.0154 -0.0099
quadrupole: 16.7886 -11.1574 -5.6313 20.2731 0.0154 -0.0099
hfenergy: -815.5716474 hartree
pointgroup: C01 [X(C13H11N3O2)]
dipole: 1.4330237 2.8698972 -0.8841169 debye
polarizability: 347.1208547|-9.1480161|183.606006|-16.8749093|-29.1018895|83.1936017 unknown
InChI: InChI=1S/C13H11N3O2/c1-9-6-10(2)16(13(17)12(9)7-14)15-8-11-4-3-5-18-11/h3-6,8H,1-2H3
charge 0 multiplicity 1
29 atoms
O  -0.66707 -1.729118 0.713387
O  3.897469 -1.573154 0.344236
N  -0.415548 0.546414 0.077577
N  0.991898 0.560649 -0.025668
N  -4.159708 -2.449325 1.156477
C  -0.995332 1.790481 -0.22028
C  -3.244345 0.855993 0.1913
C  -2.377001 1.934308 -0.16312
C  -2.664655 -0.389197 0.490169
C  -1.218313 -0.617635 0.450497
C  -0.088055 2.934064 -0.594041
C  -4.738804 1.08513 0.233073
C  1.724922 -0.516886 0.214681
C  3.157702 -0.390766 0.077876
C  -3.469284 -1.519797 0.854559
C  4.047223 0.63196 -0.262697
C  5.374955 0.081027 -0.209664
C  5.245053 -1.252842 0.160351
H  -2.802341 2.912561 -0.399577
H  0.632056 3.151973 0.21324
H  -0.693371 3.832569 -0.79514
H  0.512995 2.691103 -1.48705
H  -4.985559 1.892099 0.94797
H  -5.290055 0.179424 0.529059
H  -5.107643 1.407825 -0.758481
H  1.323691 -1.492898 0.508023
H  3.762558 1.650045 -0.517406
H  6.308462 0.59971 -0.417194
H  5.9497 -2.062315 0.328443
