program: Gaussian 09
title: 000264990
version: EM64L-G09RevD.01
frameworkgroup: C1[X(C5H9NO2)]
method: RPBEPBE
basis: SDD
operation: Freq
keyword: #pfreq=noraman
keyword: PBEPBE/SDD
title: #p freq=noraman PBEPBE/SDD
converged: YES YES NO NO
title: Mulliken charges:
elementType: O O N C C C C C H H H H H H H H H
charge: -0.459986 -0.288573 -0.317037 -0.427127 -0.380516 -0.110773 -0.428600 0.126763 0.233342 0.242609 0.215519 0.226529 0.213413 0.229613 0.235733 0.324653 0.364439
chargesum: 0.00000
title: Mulliken charges with hydrogens summed into heavy atoms:
elementType: O O N C C C C C
charge: -0.095547 -0.288573 0.007616 0.048824 0.061531 0.102640 0.036746 0.126763
polarizability: 7.82354269e+01 -8.33689819e-01 6.41036770e+01 3.49090952e+00 -1.78108777e+00 4.77538834e+01
1716.lowfreq: -23.3548 0.0003 0.0005 0.0007 9.4392 17.1550 77.1011 123.0971 241.7196
frequency: 77.0678 123.0891 241.6852 300.2199 348.8098 395.1570 452.3317 491.9470 528.0683 590.4955 632.7041 701.2752 746.0330 844.9750 860.8286 954.5098 971.1991 1054.8009 1060.4610 1088.2877 1121.9787 1168.0833 1219.2664 1236.2516 1247.1237 1292.2290 1303.6109 1330.4535 1345.6331 1362.6647 1401.9506 1413.9457 1467.6447 1489.1051 1490.4153 1637.3395 2939.3193 2970.4837 3004.5914 3024.1787 3056.4186 3071.2284 3088.1101 3384.5986 3544.3971
redmass: 1.9046 4.9382 2.6429 4.9264 2.8481 4.6100 1.8509 2.1184 2.6275 1.7892 2.1096 3.3180 2.0609 2.0583 2.6398 1.8790 2.4638 2.6747 2.6742 2.8630 2.7845 1.3089 1.4911 1.2091 1.1154 1.2234 1.4977 1.1981 1.4859 1.3827 1.5360 2.2808 1.0786 1.0853 1.1074 6.4263 1.0823 1.0689 1.0597 1.0620 1.1008 1.0983 1.1044 1.0644 1.0777
irintensity: 0.3578 1.9443 3.7737 28.8149 2.4904 12.8488 72.7548 37.2132 7.6108 59.6656 32.2822 36.1927 17.1641 7.6838 14.8383 6.4808 15.3392 100.5673 17.0189 12.1099 10.6776 9.3725 0.7097 6.4770 6.7314 7.7248 135.3918 2.6807 10.2081 16.1103 28.6195 12.9478 4.2297 1.2099 20.5805 298.7621 40.3252 49.6181 32.2564 34.0270 11.8136 23.1441 48.3394 49.6781 24.2197
temp: 298.150 k
press: 1.00000 atm
elementType: 8 8 7 6 6 6 6 6 1 1 1 1 1 1 1 1 1
symmnumber: 1
zpe: 371290.8 jmol-1
zpe.correction: 0.141417 hartree
zpe.thermalcorrener: 0.148996 hartree
zpe.thermalcorrenthalpy: 0.149940 hartree
zpe.thermalcorrgfe: 0.109420 hartree
zpe.sumelectzpe: -400.499798 hartree
zpe.sumelectthermal: -400.492220 hartree
zpe.sumelectthermalent: -400.491275 hartree
zpe.sumelectthermalfe: -400.531795 hartree
dipole: 5.3045 0.7061 0.4521
dipole: 5.3703
quadrupole: -50.0178 -49.9914 -47.4023
quadrupole: 1.9859 0.1206 0.9616
quadrupole: -0.8807 -0.8542 1.7349 1.9859 0.1206 0.9616
hfenergy: -400.6412152 hartree
pointgroup: C01 [X(C5H9N1O2)]
dipole: 1.6907677 1.2666372 0.0331628 debye
dipolederiv: -0.6188204 -0.1571311 0.0988668 -0.2610233 -0.5860338 -0.0550134 0.134509 -0.009631 -0.4647154 -1.1200836 -0.2277782 -0.1737765 -0.0727089 -0.5846662 0.0836847 -0.3647058 0.0177643 -0.5081813 -0.7894934 -0.2063218 -0.0304689 -0.4391572 -0.685642 -0.1180462 0.1997986 0.0359625 -0.3862994 -0.0158773 -0.051492 0.0873916 0.0216473 0.0607874 -0.0132242 0.0675446 0.0223569 0.0695811 0.0439376 -0.0103105 0.0142505 0.0099406 -0.0292315 -0.0003417 -0.0173153 -0.0245204 0.1343088 0.3951507 0.2929183 -0.1594605 0.2504224 0.290982 0.1943803 -0.1380925 0.2089505 0.2616045 0.47024 0.0367315 0.0964979 0.0039354 0.1693138 0.0256003 0.0908423 0.0702835 0.35855 1.2901467 0.4256378 0.2677165 0.4521398 0.7851525 -0.1525257 0.3165001 -0.21476 0.3765566 0.0469986 -0.0410723 -0.0176625 -0.0052364 0.0081957 -0.0687089 0.0053774 -0.1068714 -0.0707908 0.0160723 0.0666589 -0.0605853 0.0556536 -0.039798 0.0841382 -0.0568151 0.1109514 0.0030578 -0.1060295 -0.0156805 -0.0992984 0.0020975 0.0573401 0.0055773 -0.1468174 -0.0124083 -0.0079758 0.0228519 0.0017213 0.0652596 -0.0132917 0.0318663 -0.0074026 0.1386304 -0.0015378 -0.1092843 0.0135622 -0.0164049 -0.0136441 -0.0215105 -0.0580558 -0.0953956 -0.0246311 -0.1114056 -0.1204848 -0.0229447 0.0157337 0.0270713 0.0242543 0.0616986 -0.0263356 -0.0554726 -0.1040864 -0.1643677 0.002852 -0.0801499 0.0115471 -0.097772 -0.074751 0.0583146 0.0451471 0.1057059 0.0553698 0.1254933 -0.0346922 -0.0727137 -0.0339727 0.1828391 0.0749425 -0.0895681 0.0694109 0.2577463 0.2459435 0.0016318 -0.0409915 0.124582 0.4100028 0.0103561 -0.1049316 -0.0561649 0.3153245 unknown
polarizability: 74.1591203|7.4837027|64.9816294|5.9598199|-4.5407055|50.9522376 unknown
InChI: InChI=1S/C5H9NO2/c7-4-2-1-3-6-5(4)8/h4,6-7H,1-3H2
charge 0 multiplicity 1
17 atoms
O  -1.252862 -1.938444 0.633817
O  -2.064892 0.166723 -0.848518
N  -0.050755 1.328518 -0.538678
C  1.064955 -1.221775 0.145885
C  2.01038 0.005316 -0.057591
C  -0.352094 -0.803272 0.617307
C  1.271314 1.363046 0.117905
C  -0.912868 0.28293 -0.319623
H  0.937454 -1.776872 -0.800362
H  1.480796 -1.934245 0.878834
H  2.849559 -0.019886 0.661558
H  2.449865 -0.029898 -1.070255
H  -0.288974 -0.376279 1.642428
H  1.152856 1.591008 1.196855
H  1.861612 2.182841 -0.3258
H  -0.358073 2.091066 -1.146201
H  -2.053373 -1.665377 0.09614
