program: Gaussian 09
title: 000265004
version: EM64L-G09RevD.01
frameworkgroup: C1[X(C15H14N4)]
method: RPBEPBE
basis: SDD
operation: Freq
keyword: #pfreq=noraman
keyword: PBEPBE/SDD
title: #p freq=noraman PBEPBE/SDD
converged: NO YES NO NO
title: Mulliken charges:
elementType: N N N N C C C C C C C C C C C C C C C H H H H H H H H H H H H H H
charge: -0.059094 -0.033046 -0.045177 -0.045135 -0.154531 -0.502256 0.026762 0.023983 -0.702924 0.126948 0.129047 -0.282208 -0.280168 -0.201587 -0.201333 -0.380758 -0.380967 -0.172048 -0.171836 0.242408 0.224474 0.235172 0.204640 0.217001 0.233373 0.267834 0.268827 0.237109 0.237235 0.239915 0.239777 0.229284 0.229279
chargesum: 0.00000
title: Mulliken charges with hydrogens summed into heavy atoms:
elementType: N N N N C C C C C C C C C C C C C C C
charge: -0.059094 -0.033046 -0.045177 -0.045135 0.087877 -0.042610 0.026762 0.023983 -0.047909 0.126948 0.129047 -0.014374 -0.011342 0.035522 0.035902 -0.140843 -0.141190 0.057236 0.057442
polarizability: 2.37693868e+02 -1.36620234e+01 2.01465111e+02 6.86390025e+00 1.97017686e+01 1.30076758e+02
1716.lowfreq: -9.2573 -0.0005 0.0004 0.0007 4.8035 5.0149 45.9763 47.3972 59.9047
frequency: 45.9692 47.3854 59.8856 75.0879 96.7473 115.9114 154.2660 194.2525 212.7214 233.2543 261.1890 283.7825 301.3549 360.4018 369.9891 406.8692 407.7952 452.2268 480.2804 511.9840 543.6109 559.1275 579.7743 612.1540 616.9023 690.6063 708.9816 744.3628 745.5531 749.9368 794.3293 816.8975 836.3144 891.3531 902.4477 904.2448 912.7093 956.9165 959.0021 960.6397 962.0586 969.3451 980.5771 1002.2940 1002.8780 1031.7093 1038.0183 1070.2690 1077.3231 1087.5054 1090.1019 1113.1562 1133.9534 1160.5494 1160.6139 1178.1909 1267.5300 1280.2014 1282.7965 1287.8078 1298.6230 1312.4984 1319.6601 1324.6228 1338.4193 1390.3301 1412.0016 1416.1952 1442.3702 1452.9297 1455.1991 1464.2975 1476.4824 1530.8367 1559.5574 1561.5726 1578.6726 1580.2623 1585.7197 2931.3812 2951.8669 2987.3971 3062.0252 3085.9575 3094.8002 3126.4873 3126.6988 3140.6800 3141.0255 3163.0784 3163.3661 3177.4951 3177.7435
redmass: 4.3383 4.9243 4.2260 4.0606 4.0210 4.4893 4.3068 2.1601 1.4914 4.1750 4.2733 3.2846 3.6566 5.1019 4.4253 3.6436 3.7048 3.3699 4.8449 3.0468 4.8820 5.5011 4.6407 7.3795 7.0486 5.8941 5.7296 4.0040 1.8241 1.6000 2.2456 3.3288 3.5015 1.7004 1.3579 1.3326 2.1410 4.2683 3.0755 1.5616 1.8502 5.6211 4.8193 1.3530 1.3513 2.8679 2.2191 2.0792 2.6044 1.6586 1.6897 2.1480 2.0331 1.0738 1.0756 1.3432 1.5189 1.5367 1.5730 1.4202 2.6036 4.4564 6.3817 2.2433 2.4912 1.2222 1.9211 2.0047 1.1481 2.3369 2.4310 1.0493 1.0492 9.6998 5.9617 6.0337 6.3860 5.8276 8.8044 1.0796 1.0691 1.0356 1.0939 1.1001 1.0997 1.0879 1.0879 1.0902 1.0901 1.0967 1.0965 1.0988 1.0987
irintensity: 3.0822 2.1487 2.3796 1.7451 2.3866 0.5281 0.2754 0.7937 0.3215 1.9343 3.6573 1.2421 6.8870 3.7761 8.7739 7.8767 10.4101 5.2061 11.2185 1.0530 1.2642 16.4631 15.4441 0.6514 4.0720 4.8307 4.1520 2.1225 38.2668 35.3791 50.1847 8.8558 10.1389 2.5977 1.6380 0.2834 11.1495 12.7423 3.3708 1.3687 2.6290 23.1141 5.7200 0.6627 0.4904 5.9551 3.4340 14.3942 14.1598 0.5587 7.5399 4.5471 6.4824 1.1788 0.8510 4.8022 7.2157 1.3669 2.9668 26.0378 16.2871 5.9217 3.4884 8.5474 5.7903 17.4335 12.3095 2.1890 1.8469 21.2865 35.8719 14.6106 9.1807 40.1610 14.5790 4.8470 23.5392 12.5811 11.8243 10.3126 40.8695 41.6342 30.6202 42.1717 22.7379 10.4485 10.8355 15.2717 14.3968 23.9878 35.2401 11.8488 8.2583
temp: 298.150 k
press: 1.00000 atm
elementType: 7 7 7 7 6 6 6 6 6 6 6 6 6 6 6 6 6 6 6 1 1 1 1 1 1 1 1 1 1 1 1 1 1
symmnumber: 1
zpe: 679265.7 jmol-1
zpe.correction: 0.258719 hartree
zpe.thermalcorrener: 0.274452 hartree
zpe.thermalcorrenthalpy: 0.275397 hartree
zpe.thermalcorrgfe: 0.214906 hartree
zpe.sumelectzpe: -797.629877 hartree
zpe.sumelectthermal: -797.614143 hartree
zpe.sumelectthermalent: -797.613199 hartree
zpe.sumelectthermalfe: -797.673690 hartree
dipole: -1.0818 0.6701 0.1342
dipole: 1.2796
quadrupole: -92.9686 -98.1517 -109.9579
quadrupole: -2.3881 0.7642 2.2183
quadrupole: 7.3908 2.2077 -9.5985 -2.3881 0.7642 2.2183
hfenergy: -797.8885958 hartree
pointgroup: C01 [X(C15H14N4)]
dipole: 0.3750298 -0.331175 0.0557121 debye
polarizability: 231.6059297|-19.6589357|206.0148255|-11.4421597|-20.1204409|131.6149815 unknown
InChI: InChI=1S/C15H14N4/c1-11-10-18-14(12-6-2-4-8-16-12)15(19-11)13-7-3-5-9-17-13/h2-9,11H,10H2,1H3
charge 0 multiplicity 1
33 atoms
N  -2.383258 0.18672 0.485781
N  -0.792202 2.291018 -0.741694
N  0.32825 -1.586368 -0.983013
N  1.62781 0.363061 1.01496
C  -2.88463 1.599394 0.445954
C  -2.2831 2.313815 -0.787439
C  -1.130615 0.009118 0.121964
C  -0.259221 1.182473 -0.271856
C  -4.420045 1.593514 0.454421
C  -0.618684 -1.384372 -0.013021
C  1.210814 1.142494 -0.03252
C  -1.138199 -2.435321 0.783672
C  2.102011 1.91804 -0.815476
C  -0.644506 -3.740886 0.587266
C  3.479465 1.869171 -0.520642
C  0.78476 -2.855758 -1.169626
C  2.960278 0.337322 1.295123
C  0.339858 -3.960146 -0.406126
C  3.923105 1.061039 0.553595
H  -2.512571 2.116293 1.360181
H  -2.631795 1.806535 -1.714669
H  -2.604938 3.367553 -0.839486
H  -4.820334 2.622906 0.493509
H  -4.811142 1.095019 -0.450784
H  -4.79136 1.037448 1.33229
H  -1.909159 -2.207551 1.524547
H  1.698579 2.5351 -1.622712
H  -1.017322 -4.572839 1.194371
H  4.195298 2.447885 -1.114251
H  1.534538 -2.983546 -1.959006
H  3.258755 -0.288407 2.144256
H  0.750886 -4.958138 -0.589516
H  4.984175 0.993611 0.814646
