program: Gaussian 09
title: 000265053
version: EM64L-G09RevD.01
frameworkgroup: C1[X(C17H19N2O5P)]
method: RPBEPBE
basis: SDD
operation: Freq
keyword: #p
keyword: freq=noraman
keyword: PBEPBE/SDD
title: #p freq=noraman PBEPBE/SDD
converged: YES YES NO NO
title: Mulliken charges:
elementType: P O O O O O N N C C C C C C C C C C C C C C C C C H H H H H H H H H H H H H H H H H H H
charge: 1.388227 -0.481477 -0.547173 -0.582635 -0.220232 -0.219667 -0.911296 0.014333 -0.691949 0.314311 0.189684 0.312999 0.203847 -0.585837 -0.373465 0.600764 -0.583019 -0.370709 -0.457580 0.406139 -0.388702 -0.247862 -0.256461 -0.653307 -0.651313 0.260515 0.255473 0.289117 0.243497 0.297976 0.247024 0.230201 0.285129 0.364377 0.226074 0.233019 0.242817 0.227263 0.214889 0.230456 0.242593 0.220441 0.225607 0.255916
chargesum: 0.00000
title: Mulliken charges with hydrogens summed into heavy atoms:
elementType: P O O O O O N N C C C C C C C C C C C C C C C C C
charge: 1.388227 -0.481477 -0.547173 -0.582635 -0.220232 -0.219667 -0.546920 0.014333 -0.175962 0.314311 0.189684 0.312999 0.203847 -0.296720 -0.129969 0.600764 -0.285043 -0.123685 -0.227379 0.406139 -0.103573 0.211231 0.213619 0.034630 0.050650
polarizability: 5.03492597e+02 2.48003645e+01 2.27831800e+02 -1.43535831e+01 3.62627208e+00 1.45807870e+02
1716.lowfreq: -4.2979 -1.9971 -0.0008 -0.0006 0.0009 8.6069 16.0308 23.1257 37.8020
frequency: 14.4658 22.9075 37.7895 39.5087 47.2546 56.7123 62.2225 64.3180 93.4988 106.4517 118.5136 138.0171 159.5043 162.5811 184.8720 204.1359 214.6300 236.1154 241.1164 245.8990 261.8961 290.8002 314.4590 325.5446 359.8099 386.2793 396.4966 419.2438 434.8896 441.5515 464.9492 478.4059 494.7983 509.5706 538.0407 543.4594 556.3662 588.5863 599.3911 608.5524 656.6474 672.3130 681.1681 717.0778 730.9068 736.6257 766.5649 768.3916 801.6750 805.1203 824.5397 829.2479 853.1524 859.3960 863.9796 871.8055 893.3997 917.3845 951.0662 951.9458 975.4921 989.1973 996.3499 1013.8887 1020.2516 1061.9367 1070.3058 1091.8151 1094.7414 1113.6464 1135.3891 1136.8396 1142.3153 1145.0838 1161.3495 1182.5481 1199.8336 1213.0344 1241.2848 1261.1188 1270.6801 1272.5954 1289.3347 1312.1072 1347.7871 1352.0494 1353.7455 1356.8344 1391.3699 1394.3398 1401.9999 1413.2586 1428.2033 1439.7941 1458.2493 1459.8470 1463.2690 1464.1589 1468.1122 1471.8293 1478.5997 1488.4912 1498.8806 1585.8729 1589.6862 1618.3435 1633.3487 2988.5544 2989.2429 2990.0283 3003.3391 3016.0389 3035.1828 3077.9642 3080.9588 3084.9512 3088.6517 3109.2184 3111.0599 3124.5139 3135.6896 3145.3496 3149.3332 3172.3674 3184.0211 3550.0884
redmass: 5.2679 4.2256 3.6503 4.6967 3.2548 3.5498 6.3688 3.6524 4.2610 5.2873 5.8500 4.9954 3.1915 3.5111 2.5685 3.2365 3.5908 1.4792 2.0575 2.4044 3.8045 5.3529 6.0548 5.9334 5.6276 4.8396 4.1068 2.6289 3.7728 3.0037 5.7237 5.9522 5.9728 2.9445 1.5314 4.4238 5.6579 3.5526 4.5863 6.3175 7.8629 6.7835 4.7539 3.6060 5.9577 6.5924 5.7616 3.6163 1.1240 1.1185 1.5766 4.6082 1.5634 3.1227 2.1915 2.2784 4.6925 1.5546 2.5565 1.5374 1.9124 1.3636 6.6237 3.0381 3.1072 13.6892 1.9731 2.1976 2.1611 2.0526 1.5636 1.1534 1.5192 1.5662 1.6026 2.7918 2.2375 2.7908 2.0177 1.4905 1.1193 1.1143 1.3667 2.8773 2.2408 1.2795 4.9765 1.5300 1.2278 1.2263 4.4667 2.1749 1.2713 3.4786 1.0475 1.0523 2.1690 1.0713 1.4036 3.2932 1.0574 1.0541 3.9677 7.9437 6.8930 7.5295 7.0481 1.0361 1.0360 1.0612 1.0624 1.0614 1.0992 1.1023 1.1014 1.0975 1.0986 1.1031 1.1050 1.0876 1.0930 1.0911 1.0964 1.0928 1.0948 1.0758
irintensity: 0.4670 0.0827 0.0152 1.9217 1.5645 0.6989 0.4135 0.2979 1.2499 2.3858 2.3681 10.1993 2.4791 3.9123 3.1371 1.7313 1.5011 3.0951 8.4662 10.2649 4.2346 10.8346 15.0730 6.4932 6.9789 3.7991 12.4570 14.0033 8.0478 0.6527 18.2691 4.7639 48.5976 7.8574 35.7352 5.0618 7.3338 29.2760 121.2658 69.2457 40.9586 105.5547 6.2917 18.4532 21.8644 26.7036 6.0571 6.5483 5.3547 6.1127 54.8954 210.1237 20.5424 225.1364 78.0592 134.2718 10.4816 0.2091 56.0873 10.0798 26.9153 0.3509 8.2831 141.3231 226.7165 157.2244 49.3751 6.0505 6.6912 49.0695 5.3566 0.0219 4.9275 6.8176 9.8899 10.1756 428.6528 536.9521 36.9172 47.7505 0.6028 0.1650 18.7771 171.1862 147.1693 9.5596 134.2074 25.7755 31.6977 35.2744 30.9464 147.5560 17.0384 11.5975 15.8523 6.0602 144.6545 8.9459 89.4196 7.6778 22.0630 9.2835 17.7974 9.4081 78.3027 296.1887 235.0822 13.2393 22.8090 5.6552 28.5241 33.7708 3.5764 2.0144 17.8517 38.3588 17.4102 29.4875 31.8508 14.1517 6.9949 2.3608 23.3789 1.3015 1.5427 86.3264
temp: 298.150 k
press: 1.00000 atm
elementType: 15 8 8 8 8 8 7 7 6 6 6 6 6 6 6 6 6 6 6 6 6 6 6 6 6 1 1 1 1 1 1 1 1 1 1 1 1 1 1 1 1 1 1 1
symmnumber: 1
zpe: 882854.7 jmol-1
zpe.correction: 0.336262 hartree
zpe.thermalcorrener: 0.360952 hartree
zpe.thermalcorrenthalpy: 0.361896 hartree
zpe.thermalcorrgfe: 0.278764 hartree
zpe.sumelectzpe: -1484.166069 hartree
zpe.sumelectthermal: -1484.141379 hartree
zpe.sumelectthermalent: -1484.140435 hartree
zpe.sumelectthermalfe: -1484.223567 hartree
dipole: 9.5650 4.7927 2.0741
dipole: 10.8977
quadrupole: -193.6637 -148.4438 -152.9053
quadrupole: -4.5599 6.1078 -3.3077
quadrupole: -28.6594 16.5605 12.0990 -4.5599 6.1078 -3.3077
hfenergy: -1484.5023308 hartree
pointgroup: C01 [X(C17H19N2O5P1)]
dipole: 3.737823 -0.7855697 -1.9478495 debye
polarizability: 503.588103|-24.8112992|185.2917091|-12.0192982|41.5175611|188.2524552 unknown
InChI: InChI=1S/C17H19N2O5P/c1-3-23-25(22,24-4-2)18-14-5-7-16-12(10-14)9-13-11-15(19(20)21)6-8-17(13)16/h5-8,10-11,18H,3-4,9H2,1-2H3
charge 0 multiplicity 1
44 atoms
P  4.065925 -0.107951 0.522931
O  3.927494 1.510582 -0.068904
O  5.510586 -0.836626 -0.105332
O  3.917183 -0.108413 2.101573
O  -7.612887 -0.019654 -0.018251
O  -6.748813 1.453978 1.495694
N  2.999191 -1.071963 -0.465419
N  -6.614978 0.537569 0.590172
C  -1.515566 0.744248 1.077661
C  -0.529393 -0.101963 0.282203
C  -1.237076 -0.961881 -0.615021
C  -2.865804 0.285197 0.541509
C  -2.675813 -0.725212 -0.458498
C  0.869133 -0.118205 0.35424
C  -0.522015 -1.851978 -1.448525
C  1.586411 -1.01311 -0.490821
C  -4.150231 0.709583 0.896314
C  -3.789917 -1.312785 -1.105751
C  0.883407 -1.873678 -1.385703
C  -5.250068 0.106623 0.233594
C  -5.087183 -0.893396 -0.756606
C  3.824086 1.80752 -1.529105
C  6.690954 -0.923495 0.811608
C  5.194977 1.839979 -2.209649
C  7.365905 0.434683 1.014578
H  -1.422421 0.569295 2.167057
H  -1.353915 1.828137 0.919476
H  1.401764 0.526142 1.062735
H  -1.044045 -2.522476 -2.139822
H  -4.336735 1.475769 1.653645
H  -3.653872 -2.085568 -1.869314
H  1.44918 -2.558592 -2.028656
H  -5.977373 -1.317754 -1.227957
H  3.461711 -1.818602 -0.989547
H  3.147537 1.072264 -2.005461
H  3.339752 2.798122 -1.540172
H  6.359204 -1.354378 1.774504
H  7.348026 -1.640047 0.292471
H  5.078411 2.160259 -3.262298
H  5.862259 2.558265 -1.702851
H  5.671981 0.845078 -2.195569
H  8.283203 0.304425 1.618654
H  7.647528 0.885455 0.047549
H  6.701201 1.132355 1.553666
