program: Gaussian 09
title: 000265082
version: EM64L-G09RevD.01
frameworkgroup: C1[X(C20H18N2O5)]
method: RPBEPBE
basis: SDD
operation: Freq
keyword: #p
keyword: freq=noraman
keyword: PBEPBE/SDD
title: #p freq=noraman PBEPBE/SDD
converged: YES YES NO NO
title: Mulliken charges:
elementType: O O O O O N N C C C C C C C C C C C C C C C C C C C C H H H H H H H H H H H H H H H H H H
charge: -0.474379 -0.326437 -0.451720 -0.405914 -0.225035 -0.258350 0.020505 0.412628 0.407177 -0.506798 0.061039 0.388280 -0.322340 0.060627 -0.458306 0.067900 -0.407045 -0.491185 -0.501293 0.438818 0.045035 -0.040527 -0.708069 -0.403574 -0.327912 -0.246897 -0.225129 0.276834 0.275300 0.277864 0.259468 0.237105 0.260347 0.275817 0.217554 0.213873 0.251492 0.223188 0.365762 0.239253 0.267526 0.235175 0.373064 0.236860 0.392419
chargesum: 0.00000
title: Mulliken charges with hydrogens summed into heavy atoms:
elementType: O O O O O N N C C C C C C C C C C C C C C C C C C C C
charge: -0.108616 -0.326437 -0.078656 -0.013494 -0.225035 -0.258350 0.020505 0.412628 0.407177 0.045335 0.061039 0.388280 -0.322340 0.060627 -0.180443 0.067900 0.089527 -0.230837 -0.007921 0.438818 0.045035 -0.040527 -0.019517 -0.164321 -0.060386 -0.011722 0.011731
polarizability: 4.36482346e+02 -4.20479088e+01 2.78695636e+02 6.80760223e+00 -2.99039734e+00 1.34290168e+02
1716.lowfreq: -6.3909 -3.0330 -0.0007 -0.0004 0.0005 4.9502 24.4487 39.7040 50.0061
frequency: 24.4052 39.6820 50.0028 58.4901 70.9214 82.1341 93.8047 110.4113 134.8102 152.9415 156.1257 180.5002 195.4864 209.4094 231.8279 241.1651 251.9056 270.4262 278.3602 298.1972 307.9119 315.1387 323.8927 333.6207 363.6873 405.5026 410.2418 442.4609 448.8518 479.3822 481.0421 507.5603 523.2140 535.9701 548.6040 572.0858 586.8521 614.0306 621.4751 634.9511 637.7997 645.2732 658.8774 697.0832 715.0954 724.0541 734.6895 752.8186 770.8922 775.9734 777.2464 796.7282 800.4616 867.5265 870.6051 878.6627 902.0017 913.6008 937.9678 943.9082 952.9542 959.8018 969.0227 989.9919 995.5865 999.1878 1018.5434 1039.1664 1049.4282 1073.5064 1095.9766 1103.5010 1134.9205 1144.0439 1158.7205 1161.4146 1173.4220 1180.2191 1190.7940 1204.1533 1232.2552 1247.2208 1253.6292 1276.1003 1280.3773 1297.6665 1314.2564 1316.1619 1334.6718 1349.2227 1362.7074 1382.9995 1388.4927 1390.4930 1400.9203 1409.7356 1424.0703 1455.6502 1462.1929 1467.7922 1477.2199 1478.0320 1487.4479 1498.6937 1505.5030 1547.0543 1559.3634 1618.6754 1626.7801 1630.0739 1645.2718 2956.4413 2987.7528 3005.9882 3018.7440 3053.7650 3067.7180 3083.9531 3104.5253 3123.8856 3132.9513 3141.1289 3158.2855 3164.7617 3172.8754 3201.0934 3416.9502 3469.7244 3500.9533
redmass: 5.3598 5.5534 5.2958 8.5624 5.3736 4.5552 8.2221 2.5181 4.1222 5.6076 5.7259 3.5098 2.9314 2.2581 5.0102 4.0931 3.0542 3.9188 3.1722 3.0765 6.9114 4.1406 4.2724 2.7382 2.7129 3.6426 1.7185 5.9389 6.3218 2.9697 3.9814 3.9990 4.0485 4.6043 5.4847 3.2552 6.4556 4.9335 5.2942 1.7911 2.0621 4.6006 1.7300 5.4612 5.2210 4.9440 4.2521 4.6592 1.3441 1.9712 2.7617 4.1561 3.0521 1.5334 5.1784 1.5499 4.0184 1.5602 2.5731 2.9108 2.4827 4.5838 1.3978 3.4621 1.7793 1.3802 2.1841 3.5648 2.6302 2.4913 2.7865 2.3574 1.8863 2.0596 1.7521 1.1090 1.6738 1.6277 2.4766 1.6050 2.6161 2.1217 2.2371 1.4187 1.5440 2.4656 1.5189 2.0403 1.4348 2.9464 1.8806 1.3147 1.2670 2.1684 6.0760 3.3596 2.7020 1.0868 1.8357 1.7658 1.0769 1.1935 1.0571 4.1486 4.4193 7.7606 8.5983 6.7473 7.8581 9.0713 8.6978 1.0716 1.0368 1.0597 1.0607 1.1031 1.0995 1.1004 1.1005 1.0880 1.0932 1.0890 1.0946 1.0906 1.0997 1.0917 1.0651 1.0650 1.0641
irintensity: 0.5736 0.8629 1.7172 2.6936 0.2179 3.5523 2.5195 1.1753 0.5721 7.6971 3.0912 0.6669 2.1031 0.8883 10.2320 0.9509 3.2921 2.4052 1.5349 3.2796 1.5440 4.7241 2.1648 49.3555 27.5667 1.8594 72.8912 4.5204 6.4918 6.6118 14.7063 6.7346 6.4134 3.5214 2.4260 7.8952 2.4591 21.2435 5.2608 131.9018 116.2462 44.7875 182.2162 8.8462 18.2840 26.2833 11.6649 4.9109 62.3186 18.0109 7.2335 6.0510 5.3445 36.2709 4.7227 3.6239 4.8019 11.6415 21.0695 67.6842 78.7421 13.3607 3.3890 7.9585 7.3452 0.3269 9.0549 12.5845 193.5212 22.7494 11.0194 15.9252 3.9355 10.7080 4.3113 1.8027 118.4100 8.6487 12.0383 21.1617 14.2644 5.9019 19.3354 24.3378 9.4210 27.6467 56.3367 12.5529 20.6417 33.0712 6.0803 192.4281 6.2606 23.3977 10.1973 5.5203 16.3444 11.9539 9.1598 4.9832 25.3166 5.5557 8.1401 25.2403 9.7097 204.1602 61.8404 35.8730 24.2469 211.6284 75.2984 40.4729 37.5407 4.7350 12.5480 2.7003 8.7226 28.5093 18.4297 4.2395 8.4393 9.6891 21.7952 5.4748 26.4924 6.0829 30.1711 43.4835 33.0568
temp: 298.150 k
press: 1.00000 atm
elementType: 8 8 8 8 8 7 7 6 6 6 6 6 6 6 6 6 6 6 6 6 6 6 6 6 6 6 6 1 1 1 1 1 1 1 1 1 1 1 1 1 1 1 1 1 1
symmnumber: 1
zpe: 902375.1 jmol-1
zpe.correction: 0.343697 hartree
zpe.thermalcorrener: 0.367087 hartree
zpe.thermalcorrenthalpy: 0.368031 hartree
zpe.thermalcorrgfe: 0.290971 hartree
zpe.sumelectzpe: -1256.657498 hartree
zpe.sumelectthermal: -1256.634107 hartree
zpe.sumelectthermalent: -1256.633163 hartree
zpe.sumelectthermalfe: -1256.710224 hartree
dipole: 7.4038 -3.3446 0.0405
dipole: 8.1243
quadrupole: -143.2721 -153.1372 -162.3681
quadrupole: 18.8545 1.2254 -6.8461
quadrupole: 9.6537 -0.2114 -9.4423 18.8545 1.2254 -6.8461
hfenergy: -1257.0011942 hartree
pointgroup: C01 [X(C20H18N2O5)]
dipole: 2.9726456 1.0814003 0.4587777 debye
polarizability: 439.7729179|28.8047172|268.4714133|24.1684191|28.4572996|141.2238184 unknown
InChI: InChI=1S/C20H18N2O5/c1-2-20(27,19(25)26)14-8-16-17-12(9-22(16)18(24)13(14)10-23)7-11-5-3-4-6-15(11)21-17/h3-8,23,25,27H,2,9-10H2,1H3
charge 0 multiplicity 1
45 atoms
O  -4.386316 0.830617 0.899315
O  -1.584859 -3.329866 -0.637435
O  -3.94232 -2.387326 -1.711367
O  -1.998642 3.467592 0.110583
O  -3.03617 2.826215 2.078007
N  -0.075823 -1.609778 -0.222239
N  2.427947 0.923107 0.325596
C  0.246492 -0.275778 0.016741
C  -2.128255 0.270331 0.007957
C  1.117335 -2.493711 -0.321703
C  -3.25208 1.33963 0.117851
C  2.25101 -1.51471 -0.098533
C  1.710191 -0.188838 0.101241
C  -2.451148 -1.077133 -0.243651
C  -0.753598 0.675558 0.124891
C  -1.388512 -2.084079 -0.383858
C  -3.772276 1.710307 -1.302872
C  3.625905 -1.689708 -0.061213
C  -3.844199 -1.673604 -0.428927
C  4.452037 -0.536025 0.174872
C  -2.75981 2.596793 0.877591
C  3.80907 0.757187 0.363731
C  -4.931957 2.724432 -1.289423
C  5.879727 -0.613802 0.231081
C  4.620885 1.911714 0.599622
C  6.646592 0.53117 0.46353
C  6.012663 1.801239 0.648799
H  1.132973 -2.985824 -1.311556
H  1.054727 -3.293847 0.438313
H  -0.460619 1.71355 0.282926
H  -4.094687 0.772389 -1.788506
H  -2.918983 2.100176 -1.886383
H  4.092388 -2.671013 -0.205636
H  -4.627135 -0.909452 -0.434855
H  -4.049931 -2.367397 0.41437
H  -4.615763 3.703776 -0.884405
H  -5.769644 2.347429 -0.679477
H  -5.297746 2.892366 -2.317939
H  -4.253161 1.102843 1.849028
H  6.365383 -1.586782 0.088817
H  4.110754 2.869691 0.737823
H  7.738816 0.46153 0.504896
H  -3.283494 -3.137096 -1.651646
H  6.627444 2.689402 0.829955
H  -1.728512 4.253529 0.660485
