program: Gaussian 09
title: 000265054
version: EM64L-G09RevD.01
frameworkgroup: C1[X(C19H21Cl2N2O4P)]
method: RPBEPBE
basis: SDD
operation: Freq
keyword: #p
keyword: freq=noraman
keyword: PBEPBE/SDD
title: #p freq=noraman PBEPBE/SDD
converged: YES YES NO NO
title: Mulliken charges:
elementType: Cl Cl P O O O O N N C C C C C C C C C C C C C C C C C C C H H H H H H H H H H H H H H H H H H H H H
charge: -0.035784 -0.020396 1.385657 -0.488370 -0.546568 -0.584924 -0.221802 -0.914691 -0.472843 -0.692281 0.325893 0.408725 0.155338 0.280451 -0.602728 -0.354002 -0.625746 0.611571 -0.485324 -0.467951 0.740200 -0.309642 0.221338 -0.218457 -0.255872 -0.771587 -0.661031 -0.652745 0.264905 0.265567 0.286425 0.242009 0.266824 0.228720 0.363437 0.309850 0.229859 0.222101 0.227289 0.242259 0.256969 0.258162 0.214462 0.232725 0.236325 0.209440 0.255255 0.221236 0.219749
chargesum: 0.00000
title: Mulliken charges with hydrogens summed into heavy atoms:
elementType: Cl Cl P O O O O N N C C C C C C C C C C C C C C C C C C C
charge: -0.035784 -0.020396 1.385657 -0.488370 -0.546568 -0.584924 -0.221802 -0.551253 -0.162992 -0.161809 0.325893 0.408725 0.155338 0.280451 -0.316303 -0.111993 -0.625746 0.611571 -0.218500 -0.239231 0.740200 -0.309642 0.221338 0.233503 0.213677 -0.041993 0.017459 0.043495
polarizability: 4.94863138e+02 1.32154612e+01 2.60383096e+02 -1.29089965e+01 1.91098580e+01 1.83182410e+02
1716.lowfreq: -11.6144 -3.7434 -0.7411 -0.0019 -0.0017 -0.0009 11.1369 12.3787 19.0580
frequency: 8.3003 11.0192 19.0061 31.0993 39.7782 43.8196 54.4000 58.2321 62.6059 66.3913 78.1190 88.0646 91.1314 108.9666 122.8180 126.2829 138.9231 161.4154 172.9344 186.8385 205.2258 226.9035 227.7215 241.3523 263.9386 269.5315 279.2459 283.0327 292.1626 311.6979 329.3727 332.7979 347.3478 392.4622 402.7059 423.6454 435.7448 441.0503 467.4368 484.6415 513.7521 521.6910 528.2134 540.3025 562.7514 573.3934 577.2226 600.3110 624.5683 645.6066 671.1857 685.2273 710.6002 713.8640 747.9095 755.3339 785.6048 802.7346 803.3438 812.2071 824.3024 836.5997 864.5519 867.5028 879.6268 882.1351 909.7300 946.0632 950.3329 954.4948 972.6319 1007.4537 1014.8621 1021.0613 1037.1286 1040.2822 1063.3001 1093.2742 1105.7408 1122.1203 1130.3424 1136.9286 1146.3631 1160.7655 1175.2239 1205.6094 1220.1111 1236.1870 1251.5366 1255.3041 1271.9611 1283.3665 1309.0392 1344.3122 1353.0820 1355.2827 1356.4314 1383.2965 1393.1573 1396.5693 1406.1179 1411.2564 1430.0931 1445.3580 1448.9317 1457.5395 1460.5472 1461.1614 1465.4891 1467.1964 1468.6018 1475.9546 1479.8563 1487.1261 1494.2557 1564.3649 1592.9356 1616.2958 1635.0464 1644.9304 2986.2271 2987.5718 2993.4078 2993.8859 2996.7637 3015.1872 3037.5387 3049.5432 3080.9367 3084.5383 3086.3444 3093.0270 3109.6140 3111.5014 3119.3762 3123.8202 3135.3802 3148.4152 3167.3228 3528.0680 3553.4396
redmass: 5.1415 4.6166 2.8632 5.3542 4.2074 3.0121 2.0547 4.0260 3.2420 2.1750 1.8503 5.4881 5.1871 8.2398 5.5904 5.6208 6.1561 5.9269 3.3461 5.2923 2.6728 3.8624 2.1878 1.4980 2.6704 5.3421 3.6147 3.5468 4.0742 5.9560 7.1308 8.4587 6.7813 5.2213 4.3031 2.7781 4.1084 3.9974 4.2945 4.3637 1.4246 1.4472 4.8022 4.9240 3.5345 6.1797 3.4002 5.5713 6.3170 4.3834 6.3750 6.3801 5.0374 5.9797 5.0313 3.7322 5.8613 2.3078 1.6672 1.0912 1.5095 5.1106 3.3355 1.6444 2.9888 1.7491 4.3470 1.6388 3.0837 1.8841 2.6672 2.2304 2.6880 3.0333 1.7659 5.3676 11.9229 2.1724 2.2721 2.3903 1.4118 1.1398 1.5669 1.6041 2.4360 2.5937 1.5529 2.0190 1.2516 1.7599 1.1125 1.4707 4.0092 2.4685 1.2895 3.1154 1.6696 1.2268 1.2272 1.2416 2.7385 2.1773 1.3908 1.4154 2.9335 1.0400 1.0748 2.1203 1.0782 1.6783 1.4159 1.0678 1.0559 1.1164 3.1586 7.9678 7.0184 9.7252 7.0835 7.1030 1.0544 1.0358 1.0613 1.0372 1.0378 1.0618 1.0990 1.1084 1.1017 1.0989 1.0983 1.0981 1.1051 1.1021 1.0988 1.0876 1.0930 1.0969 1.0928 1.0766 1.0758
irintensity: 1.4931 1.9275 0.3430 0.3717 2.5307 0.3083 2.6955 4.6260 2.0215 4.6245 0.1344 1.4070 0.9600 1.0681 0.3217 1.5383 11.2645 1.0322 13.7614 0.0824 2.4961 3.1400 8.0124 2.4747 12.9148 8.3813 2.8888 12.5510 1.7776 6.2335 6.8790 1.4630 5.7942 1.0643 3.3391 7.1763 7.7967 19.7314 38.6611 47.4938 97.6571 57.4352 2.7717 7.4901 3.2884 1.9292 5.1160 6.4284 158.4311 28.6154 91.9030 18.1747 46.4393 48.3815 6.6733 1.6188 14.2035 9.4201 16.6851 0.9945 51.4842 156.5368 255.1922 6.5042 190.3834 12.7046 9.3972 6.9733 71.6231 12.8014 13.8081 27.1687 144.0572 200.5284 31.6959 16.4391 114.9703 12.3189 18.4850 7.0987 5.1253 0.2767 7.6942 15.2046 20.1932 89.0505 3.4285 51.7644 40.0396 72.1346 0.1395 27.0791 77.3268 273.1657 7.0129 42.1950 16.2979 61.1627 32.4022 24.0674 116.4371 15.5984 19.5833 79.2836 147.9602 7.9198 26.6575 388.7259 13.9834 83.7154 21.8469 0.5067 18.3017 11.9135 36.2446 44.4700 45.3499 83.7315 209.8047 139.6108 25.1790 14.3696 4.2576 12.3994 21.9426 34.9710 2.8658 26.3454 11.9991 14.6232 33.2898 24.0917 32.4653 38.5197 10.1414 16.7047 7.5046 15.8381 1.3726 21.1168 73.4713
temp: 298.150 k
press: 1.00000 atm
elementType: 17 17 15 8 8 8 8 7 7 6 6 6 6 6 6 6 6 6 6 6 6 6 6 6 6 6 6 6 1 1 1 1 1 1 1 1 1 1 1 1 1 1 1 1 1 1 1 1 1
symmnumber: 1
zpe: 966445.2 jmol-1
zpe.correction: 0.368100 hartree
zpe.thermalcorrener: 0.398184 hartree
zpe.thermalcorrenthalpy: 0.399128 hartree
zpe.thermalcorrgfe: 0.301194 hartree
zpe.sumelectzpe: -2406.339087 hartree
zpe.sumelectthermal: -2406.309003 hartree
zpe.sumelectthermalent: -2406.308058 hartree
zpe.sumelectthermalfe: -2406.405992 hartree
dipole: 4.5334 1.2429 -0.0004
dipole: 4.7007
quadrupole: -153.2937 -178.4977 -192.2851
quadrupole: 22.1935 32.8371 -1.1779
quadrupole: 21.3984 -3.8055 -17.5929 22.1935 32.8371 -1.1779
hfenergy: -2406.7071864 hartree
pointgroup: C01 [X(C19H21Cl2N2O4P1)]
dipole: 1.7719614 -0.475171 -0.2336202 debye
polarizability: 493.9534943|-23.6398591|229.2811909|5.0504785|42.5474577|215.1939584 unknown
InChI: InChI=1S/C19H21Cl2N2O4P/c1-4-26-28(25,27-5-2)23-13-6-7-14-12(8-13)9-16-15(14)10-17(20)19(18(16)21)22-11(3)24/h6-8,10,22-23H,4-5,9H2,1-3H3
charge 0 multiplicity 1
49 atoms
Cl -3.499357 1.954815 2.162552
Cl -5.746659 -1.959717 -1.145341
P  4.875367 -0.355512 0.481001
O  4.725252 1.207733 -0.247951
O  6.298419 -1.117515 -0.156645
O  4.794898 -0.21244 2.057953
O  -6.423199 1.154318 -1.409994
N  3.779178 -1.403347 -0.37196
N  -5.776339 0.505513 0.74518
C  -0.671292 0.581993 1.148359
C  0.281046 -0.329823 0.383301
C  -2.034133 0.119265 0.661375
C  -0.458036 -1.225634 -0.447888
C  -1.89261 -0.949087 -0.27876
C  1.680533 -0.367544 0.429805
C  0.222604 -2.174308 -1.240991
C  -3.313458 0.576608 0.975478
C  2.365039 -1.322252 -0.375223
C  -3.026717 -1.555949 -0.856701
C  1.630234 -2.218154 -1.204678
C  -4.48883 0.008822 0.403207
C  -4.300666 -1.082417 -0.490093
C  -6.680791 1.058101 -0.181373
C  4.744521 1.3392 -1.737032
C  7.550765 -1.016907 0.65455
C  -8.008649 1.495333 0.429682
C  4.579266 2.827728 -2.028072
C  8.188598 0.370388 0.546578
H  -0.496893 1.652699 0.928409
H  -0.566415 0.469641 2.244781
H  2.238529 0.305932 1.090066
H  -0.324755 -2.872055 -1.884137
H  -2.93896 -2.390637 -1.557111
H  2.169978 -2.947703 -1.820329
H  4.221844 -2.189853 -0.852511
H  -5.973876 0.642849 1.739108
H  3.914978 0.743208 -2.16309
H  5.706388 0.946997 -2.119041
H  8.190169 -1.801738 0.218915
H  7.314751 -1.272023 1.704592
H  -8.765248 0.711599 0.242803
H  -8.347513 2.41457 -0.07313
H  -7.95607 1.672353 1.518459
H  5.401969 3.407368 -1.576723
H  3.624767 3.19939 -1.6191
H  4.584186 3.000215 -3.120375
H  7.534474 1.143894 0.986126
H  8.389417 0.631395 -0.507083
H  9.148593 0.382287 1.095654
