program: Gaussian 09
title: 000265079
version: EM64L-G09RevD.01
frameworkgroup: C1[X(C17H14F3N3O8)]
method: RPBEPBE
basis: SDD
operation: Freq
keyword: #p
keyword: freq=noraman
keyword: PBEPBE/SDD
title: #p freq=noraman PBEPBE/SDD
converged: YES YES NO NO
title: Mulliken charges:
elementType: F F F O O O O O O O O N N N C C C C C C C C C C C C C C C C C H H H H H H H H H H H H H H
charge: -0.145853 -0.170892 -0.152402 -0.247361 -0.452666 -0.286694 -0.248128 -0.203086 -0.224597 -0.194160 -0.197421 -0.173703 -0.412886 0.028755 -0.136531 -0.079187 -0.516922 -0.041181 -0.361229 -0.176100 0.235798 0.075959 0.144062 0.295670 0.207008 0.241103 -0.316551 -0.310674 -0.347009 -0.342885 0.390508 0.256257 0.307938 0.252831 0.266184 0.280643 0.276577 0.238204 0.359013 0.362196 0.371846 0.284332 0.276455 0.295041 0.291738
chargesum: 0.00000
title: Mulliken charges with hydrogens summed into heavy atoms:
elementType: F F F O O O O O O O O N N N C C C C C C C C C C C C C C C C C
charge: -0.145853 -0.170892 -0.152402 -0.247361 -0.093653 -0.286694 -0.248128 -0.203086 -0.224597 -0.194160 -0.197421 -0.173703 -0.041041 0.028755 0.119726 0.228751 0.002094 0.239462 0.153552 0.186096 0.235798 0.075959 0.144062 0.295670 0.207008 0.241103 -0.032219 -0.034220 -0.051968 -0.051147 0.390508
polarizability: 3.50685560e+02 2.52435524e+01 2.01738309e+02 -2.29938423e+01 1.78153365e+01 1.81792893e+02
1716.lowfreq: -8.2855 -2.9129 -0.0005 0.0007 0.0008 3.2160 10.7423 14.7743 17.7067
frequency: 10.2504 14.4140 17.6797 24.8297 35.2203 42.1782 58.3036 59.3835 72.2354 74.0396 87.3241 92.4647 113.3418 141.8946 160.4766 173.3054 177.3673 192.9092 211.6514 237.5114 254.0290 270.0957 276.7540 291.8118 309.6874 320.3347 330.6898 342.9260 374.6034 390.1397 399.1667 407.9149 409.7848 454.7045 470.4109 474.5373 483.7360 492.3495 510.5405 518.6453 529.7283 543.1975 570.2682 623.7016 625.7480 652.3189 659.9920 678.3292 684.8683 702.8254 711.1877 732.8389 740.6965 750.5460 755.6611 764.1028 772.3697 789.2517 797.6645 831.8509 863.7847 869.7255 880.6326 889.0801 921.4492 952.9972 965.7898 976.6199 985.4394 1003.2047 1004.8226 1008.6922 1012.5327 1014.0437 1019.0677 1030.8614 1046.8432 1083.1012 1087.2149 1089.6181 1107.9029 1110.0850 1145.1219 1169.7797 1177.0151 1181.3050 1213.1997 1227.6742 1236.9856 1242.3814 1258.4859 1275.3334 1293.9418 1298.2634 1308.8928 1318.4062 1326.7101 1352.5924 1362.6446 1370.3425 1372.9657 1385.5509 1395.8650 1405.5066 1415.4445 1444.0779 1448.8169 1459.4021 1476.2505 1592.8694 1610.3538 1621.5337 1632.7609 1653.5824 1674.7322 3021.8989 3035.9286 3041.7446 3076.0191 3080.0136 3097.1666 3111.4695 3120.1370 3165.8791 3176.0903 3189.0669 3193.8777 3519.4056 3579.4935
redmass: 10.4778 8.9436 8.1857 5.5749 11.1661 8.8766 11.2433 9.7939 7.9587 7.8120 9.2096 8.8877 6.7339 6.2038 8.6331 8.3445 8.5809 9.2253 8.1571 6.6508 5.0509 8.4713 6.8464 11.1827 1.8943 10.0312 2.0000 4.0111 5.2055 3.4022 9.6875 5.4822 2.8837 4.2243 4.5423 15.5873 7.1430 3.5490 5.8216 5.9913 10.1557 7.8291 10.7282 7.1082 6.3282 6.1997 8.0547 7.1630 3.9268 3.3062 4.3654 3.6998 5.9388 7.3836 4.6140 5.0683 4.2970 2.6351 7.6588 3.1140 1.2504 2.8581 4.4271 1.6587 6.7787 3.3996 4.7691 1.9858 3.3137 1.5043 2.7758 3.4532 1.3727 4.0082 5.9323 2.9208 4.1028 2.1345 2.2254 3.2573 2.4009 1.3934 3.8389 1.5900 1.3019 1.4196 6.5271 1.2485 1.5697 4.0799 3.8391 1.3234 1.2610 1.8462 1.8058 1.2241 1.3826 2.3306 1.3066 7.6054 1.7613 1.7297 1.8460 8.1007 4.6056 1.4650 1.2596 1.1143 2.4195 8.5710 6.3497 5.4035 10.5181 11.4072 6.1783 1.0720 1.0778 1.0578 1.0874 1.0881 1.1020 1.0978 1.1089 1.0904 1.0890 1.0958 1.0974 1.0771 1.0667
irintensity: 0.9974 1.1493 0.5592 1.4829 0.0370 0.8903 0.1575 0.9727 0.3610 1.6490 3.5249 0.2190 1.5265 8.9846 1.0254 3.7316 3.1402 0.6253 14.1333 5.7236 5.4897 0.2318 2.0912 4.8884 47.2755 5.5756 151.0735 17.4680 3.7266 7.6674 6.3936 8.5859 0.0210 3.6525 6.9301 0.3592 4.5675 6.5457 27.2912 10.5315 8.0767 22.0411 44.1236 0.6842 2.7720 0.4939 1.2391 2.7022 61.8747 16.5757 1.7826 14.8319 13.6929 8.0123 13.7473 4.5525 27.0694 96.6772 25.1309 6.3928 1.5076 16.6023 32.9263 50.8228 29.9723 77.1171 62.0547 111.1976 261.8223 22.0663 75.9903 154.2226 0.6403 102.3064 107.4466 290.6011 219.0514 14.3059 10.5336 12.1756 122.0417 9.0246 43.5207 92.5128 14.5621 32.5975 471.9398 7.4311 70.1339 137.2234 114.9960 1.4542 0.6988 14.5267 52.0053 8.2971 1.4216 262.9601 11.1560 81.1747 53.6939 33.8563 47.8397 10.6449 68.8677 55.6969 65.9697 7.5745 4.0080 27.5001 1.7626 16.1869 134.4339 240.3681 893.9465 9.6220 32.4594 21.7961 3.0973 7.7239 13.5369 104.7125 5.2218 1.3450 1.3098 0.7848 1.1812 76.3013 14.4806
temp: 298.150 k
press: 1.00000 atm
elementType: 9 9 9 8 8 8 8 8 8 8 8 7 7 7 6 6 6 6 6 6 6 6 6 6 6 6 6 6 6 6 6 1 1 1 1 1 1 1 1 1 1 1 1 1 1
symmnumber: 1
zpe: 809735.9 jmol-1
zpe.correction: 0.308412 hartree
zpe.thermalcorrener: 0.336258 hartree
zpe.thermalcorrenthalpy: 0.337202 hartree
zpe.thermalcorrgfe: 0.244448 hartree
zpe.sumelectzpe: -1719.463976 hartree
zpe.sumelectthermal: -1719.436130 hartree
zpe.sumelectthermalent: -1719.435186 hartree
zpe.sumelectthermalfe: -1719.527941 hartree
dipole: 3.2122 -4.7260 -3.9538
dipole: 6.9488
quadrupole: -269.3826 -189.9777 -172.8635
quadrupole: 5.6903 14.5044 3.3478
quadrupole: -58.6414 20.7636 37.8778 5.6903 14.5044 3.3478
hfenergy: -1719.7723883 hartree
pointgroup: C01 [X(C17H14F3N3O8)]
dipole: -0.8412901 -2.1061606 1.5265167 debye
polarizability: 346.097611|-7.7745459|200.7989948|-43.130887|-18.1655686|187.3201562 unknown
InChI: InChI=1S/C17H14F3N3O8/c18-17(19,20)10-6-22(16(27)21-14(10)25)13-5-11(24)12(31-13)7-30-15(26)8-1-3-9(4-2-8)23(28)29/h1-4,6,11-13,21,24H,5,7H2
charge 0 multiplicity 1
45 atoms
F  5.187882 3.326702 -1.689851
F  3.532848 3.097469 -0.154073
F  5.694509 3.252039 0.515741
O  1.712973 -1.399818 -1.203017
O  1.076638 0.678553 0.991983
O  -1.862948 -1.931394 -0.141244
O  5.217097 -2.934624 -0.679826
O  7.3522 1.198675 -1.081726
O  -2.525587 -0.845219 -2.100213
O  -8.743963 0.358992 1.018342
O  -8.02685 -0.780986 2.859979
N  3.924199 -0.982013 -0.355203
N  6.229707 -0.835525 -0.874428
N  -7.855617 -0.309576 1.671386
C  0.753096 -0.757491 0.919645
C  0.422982 -1.041895 -0.556247
C  1.986105 -1.658665 1.192242
C  2.695856 -1.804512 -0.18126
C  -0.546336 -2.220448 -0.771723
C  3.863023 0.400071 -0.325746
C  5.139945 -1.679503 -0.646128
C  4.966139 1.194451 -0.544565
C  6.273975 0.594192 -0.853498
C  4.856454 2.684251 -0.476105
C  -2.784404 -1.22856 -0.936543
C  -4.081055 -1.01166 -0.227205
C  -5.088078 -0.275969 -0.905495
C  -4.320541 -1.517557 1.077034
C  -6.330245 -0.041157 -0.288878
C  -5.55941 -1.289976 1.704747
C  -6.543142 -0.553655 1.00944
H  -0.099263 -0.99507 1.582987
H  0.047491 -0.133919 -1.0553
H  1.657447 -2.65548 1.5351
H  2.652446 -1.241553 1.964545
H  3.025399 -2.83652 -0.380465
H  -0.678696 -2.390029 -1.852873
H  -0.197092 -3.141507 -0.277412
H  1.148914 0.969836 1.935071
H  2.876829 0.824521 -0.100289
H  7.116508 -1.305462 -1.086609
H  -4.877715 0.100557 -1.911188
H  -3.538777 -2.088579 1.583488
H  -7.125079 0.521649 -0.784517
H  -5.778367 -1.666235 2.707099
